Merge branch 'v2.0' of gitlab.ow2.org:antoinerosier/lemonldap-ng into v2.0

10 jobs for v2.0 in 16 minutes and 29 seconds (queued for 29 seconds)
Name Stage Failure
failed
build_centos_7 Build
make: *** [portal_test] Error 2
error: Bad exit status from /var/tmp/rpm-tmp.5Awv2j (%check)
Bad exit status from /var/tmp/rpm-tmp.5Awv2j (%check)


RPM build errors:
ci-build-pkg: rpmbuild failed
Cleaning up project directory and file based variables
ERROR: Job failed: exit code 1

failed
build_centos_8 Build
make: *** [Makefile:409: portal_test] Error 2
error: Bad exit status from /var/tmp/rpm-tmp.SdiTtd (%check)


RPM build errors:
Bad exit status from /var/tmp/rpm-tmp.SdiTtd (%check)
ci-build-pkg: rpmbuild failed
Cleaning up project directory and file based variables
ERROR: Job failed: exit code 1

failed
build_bionic Build
dh_auto_test: make -j4 -O test returned exit code 2
debian/rules:21: recipe for target 'build' failed
make: *** [build] Error 25
dpkg-buildpackage: error: debian/rules build subprocess returned exit status 2
debuild: fatal error at line 1152:
dpkg-buildpackage -rfakeroot -us -uc -ui failed
ci-build-pkg: debuild failed
Cleaning up project directory and file based variables
ERROR: Job failed: exit code 1

failed
build_buster Build
make[1]: Leaving directory '/builds/antoinerosier/lemonldap-ng'
dh_auto_test: make -j4 test returned exit code 2
make: *** [debian/rules:21: build] Error 2
dpkg-buildpackage: error: debian/rules build subprocess returned exit status 2
debuild: fatal error at line 1182:
dpkg-buildpackage -us -uc -ui failed
ci-build-pkg: debuild failed
Cleaning up project directory and file based variables
ERROR: Job failed: exit code 1

failed
build_bullseye Build
Get:21 http://deb.debian.org/debian bullseye/main amd64 libgssapi-krb5-2 amd64 1.18.3-6+deb11u1 [165 kB]
Get:22 http://deb.debian.org/debian bullseye-updates/main amd64 tzdata all 2021a-1+deb11u2 [284 kB]
Get:23 http://deb.debian.org/debian bullseye/main amd64 devscripts amd64 2.21.3+deb11u1 [1093 kB]
Fetched 19.8 MB in 1s (24.0 MB/s)
E: Failed to fetch http://Orange-OpenSource.gitlab.io/gitlab-buildpkg-tools/debian/pool/main/a/apt-add-gitlab/apt-add-gitlab_0.1%2b20210929110725%2b379336457%2b0011%2bmaster%2bbullseye1_all.deb 502 Bad Gateway [IP: 35.185.44.232 80]
E: Failed to fetch http://Orange-OpenSource.gitlab.io/gitlab-buildpkg-tools/debian/pool/main/g/gitlab-buildpkg-tools/gitlab-buildpkg-tools_0.2%2b20210929110725%2b379336457%2b0011%2bmaster%2bbullseye1_all.deb 502 Bad Gateway [IP: 35.185.44.232 80]
E: Unable to fetch some archives, maybe run apt-get update or try with --fix-missing?
Cleaning up project directory and file based variables
ERROR: Job failed: exit code 1