Merge branch 'master' into 'master'

# Conflicts:
#   lemonldap-ng-manager/lib/Lemonldap/NG/Manager/Build/PortalConstants.pm
9 jobs for master in 21 minutes and 16 seconds (queued for 10 seconds)
latest
Status Job ID Name Coverage
  Build
passed #34070
autopkgtest

00:02:21

failed #34074
build_bionic

00:03:13

failed #34072
build_buster

00:02:14

failed #34075
build_centos_7

00:05:07

failed #34076
build_centos_8

00:02:47

failed #34073
build_disco

00:02:24

failed #34071
build_stretch

00:03:05

 
  Sign
skipped #34077
sign
 
  Deploy
skipped #34078
pages
 
Name Stage Failure
failed
build_centos_8 Build
make[1]: Leaving directory '/root/rpmbuild/centos-8/BUILD/lemonldap-ng-2.0.9/lemonldap-ng-portal'
error: Bad exit status from /var/tmp/rpm-tmp.3mazTq (%check)
Bad exit status from /var/tmp/rpm-tmp.3mazTq (%check)


RPM build errors:
ci-build-pkg: rpmbuild failed
Cleaning up file based variables
ERROR: Job failed: exit code 1
failed
build_centos_7 Build
make[1]: Leaving directory `/root/rpmbuild/centos-7/BUILD/lemonldap-ng-2.0.9/lemonldap-ng-portal'


RPM build errors:
error: Bad exit status from /var/tmp/rpm-tmp.cNEwaB (%check)
Bad exit status from /var/tmp/rpm-tmp.cNEwaB (%check)
ci-build-pkg: rpmbuild failed
Cleaning up file based variables
ERROR: Job failed: exit code 1
failed
build_bionic Build
dh_auto_test: make -j4 -O test returned exit code 2
debian/rules:21: recipe for target 'build' failed
make: *** [build] Error 25
dpkg-buildpackage: error: debian/rules build subprocess returned exit status 2
debuild: fatal error at line 1152:
dpkg-buildpackage -rfakeroot -us -uc -ui failed
ci-build-pkg: debuild failed
Cleaning up file based variables
ERROR: Job failed: exit code 1
failed
build_disco Build
make[1]: Leaving directory '/builds/artonge/lemonldap-ng'
dh_auto_test: make -j4 test returned exit code 2
make: *** [debian/rules:21: build] Error 2
dpkg-buildpackage: error: debian/rules build subprocess returned exit status 2
debuild: fatal error at line 1182:
dpkg-buildpackage -us -uc -ui failed
ci-build-pkg: debuild failed
Cleaning up file based variables
ERROR: Job failed: exit code 1
failed
build_buster Build
make[1]: Leaving directory '/builds/artonge/lemonldap-ng'
dh_auto_test: make -j4 test returned exit code 2
make: *** [debian/rules:21: build] Error 2
dpkg-buildpackage: error: debian/rules build subprocess returned exit status 2
debuild: fatal error at line 1182:
dpkg-buildpackage -us -uc -ui failed
ci-build-pkg: debuild failed
Cleaning up file based variables
ERROR: Job failed: exit code 1
failed
build_stretch Build
dh_auto_test: make -j4 test returned exit code 2
debian/rules:21: recipe for target 'build' failed
make: *** [build] Error 2
dpkg-buildpackage: error: debian/rules build gave error exit status 2
debuild: fatal error at line 1116:
dpkg-buildpackage -rfakeroot -us -uc failed
ci-build-pkg: debuild failed
Cleaning up file based variables
ERROR: Job failed: exit code 1