{
"resetCertificat":"您的憑證已被重設",
"accountCreated":"您的账号已创建，临时密码已发送至您的邮箱",
"autoMail":"該郵件已自動寄送",
"click2Register":"點擊此處以確認您的帳號註冊",
"click2Reset":"點擊此處以重設您的密碼",
"click2ResetCertificate":"點擊此處以重設您的憑證",
"goToPortal":"回到首页",
"hello":"您好",
"host":"Host",
"location":"Location",
"mail2fSubject":"[LemonLDAP::NG] 您的登入代碼",
"mailConfirmSubject":"[LemonLDAP::NG] 確認重設密碼",
"mailSubject":"[LemonLDAP::NG] 您的新密碼",
"newLocationWarningMailBody":"Your account was signed in to from a new location.",
"newLocationWarningMailSubject":"[LemonLDAP::NG] Sign-in from a new location",
"newPwdIs":"您的新密碼為",
"pwdChanged":"您的密碼已變更",
"pwdIs":"您的密碼為",
"registerConfirmSubject":"[LemonLDAP::NG] 確認帳號註冊",
"registerDoneSubject":"[LemonLDAP::NG] 您的新帳號",
"requestIssuedFromIP":"請求發出從 IP",
"resetCertificateOK":"您的憑證已成功重設！",
"date":"日期",
"yourLoginCodeIs":"您的登入代碼為",
"yourLoginIs":"您的登入為"
}