WIP - Manager

5 jobs for Moo in 14 minutes and 31 seconds (queued for 39 minutes and 15 seconds)
latest
Status Job ID Name Coverage
  Build
failed #34279
build_bionic

00:02:53

failed #34278
build_buster

00:02:05

failed #34280
build_centos_7

00:04:09

failed #34281
build_centos_8

00:02:38

failed #34277
build_stretch

00:02:44

 
Name Stage Failure
failed
build_centos_8 Build
make: *** [Makefile:412: manager_test] Error 2
error: Bad exit status from /var/tmp/rpm-tmp.kNiI6t (%check)


RPM build errors:
Bad exit status from /var/tmp/rpm-tmp.kNiI6t (%check)
ci-build-pkg: rpmbuild failed
Cleaning up file based variables
ERROR: Job failed: exit code 1
failed
build_centos_7 Build
make: *** [portal_test] Error 2


RPM build errors:
error: Bad exit status from /var/tmp/rpm-tmp.DeumUE (%check)
Bad exit status from /var/tmp/rpm-tmp.DeumUE (%check)
ci-build-pkg: rpmbuild failed
Cleaning up file based variables
ERROR: Job failed: exit code 1
failed
build_bionic Build
dh_auto_test: make -j4 -O test returned exit code 2
debian/rules:21: recipe for target 'build' failed
make: *** [build] Error 25
dpkg-buildpackage: error: debian/rules build subprocess returned exit status 2
debuild: fatal error at line 1152:
dpkg-buildpackage -rfakeroot -us -uc -ui failed
ci-build-pkg: debuild failed
Cleaning up file based variables
ERROR: Job failed: exit code 1
failed
build_buster Build
make[1]: Leaving directory '/builds/lemonldap-ng/lemonldap-ng'
dh_auto_test: make -j4 test returned exit code 2
make: *** [debian/rules:21: build] Error 2
dpkg-buildpackage: error: debian/rules build subprocess returned exit status 2
debuild: fatal error at line 1182:
dpkg-buildpackage -us -uc -ui failed
ci-build-pkg: debuild failed
Cleaning up file based variables
ERROR: Job failed: exit code 1
failed
build_stretch Build
dh_auto_test: make -j4 test returned exit code 2
debian/rules:21: recipe for target 'build' failed
make: *** [build] Error 2
dpkg-buildpackage: error: debian/rules build gave error exit status 2
debuild: fatal error at line 1116:
dpkg-buildpackage -rfakeroot -us -uc failed
ci-build-pkg: debuild failed
Cleaning up file based variables
ERROR: Job failed: exit code 1