Merge branch 'master' of gitlab.ow2.org:lemonldap-ng/lemonldap-ng

5 jobs for master in 8 minutes and 9 seconds (queued for 6 seconds)
Status Job ID Name Coverage
  Build
failed #9851
build_bionic

00:02:35

failed #9850
build_buster

00:03:05

failed #9849
build_stretch

00:02:28

 
  Sign
skipped #9852
sign
 
  Deploy
skipped #9853
pages
 
Name Stage Failure
failed
build_bionic Build
make[2]: Leaving directory '/builds/lemonldap-ng/lemonldap-ng/lemonldap-ng-portal'
dh_auto_test: make -j2 -O test returned exit code 2
debian/rules:20: recipe for target 'build' failed
make: *** [build] Error 25
dpkg-buildpackage: error: debian/rules build subprocess returned exit status 2
debuild: fatal error at line 1152:
dpkg-buildpackage -rfakeroot -us -uc -ui failed
ci-build-pkg: debuild failed
ERROR: Job failed: exit code 1
failed
build_buster Build
make[2]: Leaving directory '/builds/lemonldap-ng/lemonldap-ng/lemonldap-ng-portal'
make[1]: Leaving directory '/builds/lemonldap-ng/lemonldap-ng'
dh_auto_test: make -j2 test returned exit code 2
make: *** [debian/rules:20: build] Error 2
dpkg-buildpackage: error: debian/rules build subprocess returned exit status 2
debuild: fatal error at line 1182:
dpkg-buildpackage -us -uc -ui failed
ci-build-pkg: debuild failed
ERROR: Job failed: exit code 1
failed
build_stretch Build
make[1]: Leaving directory '/builds/lemonldap-ng/lemonldap-ng'
dh_auto_test: make -j2 test returned exit code 2
debian/rules:20: recipe for target 'build' failed
make: *** [build] Error 2
dpkg-buildpackage: error: debian/rules build gave error exit status 2
debuild: fatal error at line 1116:
dpkg-buildpackage -rfakeroot -us -uc failed
ci-build-pkg: debuild failed
ERROR: Job failed: exit code 1