Fix configuration Parser (#1603)

5 jobs for master in 8 minutes and 36 seconds (queued for 7 seconds)
Status Name Job ID Coverage
  Build
failed build_bionic #9909

00:02:39

failed build_buster #9908

00:03:00

failed build_stretch #9907

00:02:56

 
  Sign
skipped sign #9910
 
  Deploy
skipped pages #9911
 
Name Stage Failure
failed
build_bionic Build
make[2]: Leaving directory '/builds/lemonldap-ng/lemonldap-ng/lemonldap-ng-portal'
dh_auto_test: make -j2 -O test returned exit code 2
debian/rules:20: recipe for target 'build' failed
make: *** [build] Error 25
dpkg-buildpackage: error: debian/rules build subprocess returned exit status 2
debuild: fatal error at line 1152:
dpkg-buildpackage -rfakeroot -us -uc -ui failed
ci-build-pkg: debuild failed
ERROR: Job failed: exit code 1
failed
build_buster Build
make[2]: Leaving directory '/builds/lemonldap-ng/lemonldap-ng/lemonldap-ng-portal'
make[1]: Leaving directory '/builds/lemonldap-ng/lemonldap-ng'
dh_auto_test: make -j2 test returned exit code 2
make: *** [debian/rules:20: build] Error 2
dpkg-buildpackage: error: debian/rules build subprocess returned exit status 2
debuild: fatal error at line 1182:
dpkg-buildpackage -us -uc -ui failed
ci-build-pkg: debuild failed
ERROR: Job failed: exit code 1
failed
build_stretch Build
make[1]: Leaving directory '/builds/lemonldap-ng/lemonldap-ng'
dh_auto_test: make -j2 test returned exit code 2
debian/rules:20: recipe for target 'build' failed
make: *** [build] Error 2
dpkg-buildpackage: error: debian/rules build gave error exit status 2
debuild: fatal error at line 1116:
dpkg-buildpackage -rfakeroot -us -uc failed
ci-build-pkg: debuild failed
ERROR: Job failed: exit code 1