Render endpoint case insensitive (Fixes #2147)

4 jobs for lowercase-endpoints in 14 minutes and 13 seconds (queued for 3 seconds)
latest
Status Job ID Name Coverage
  Build
failed #25595
build_bionic

00:02:42

failed #25594
build_buster

00:02:42

failed #25596
build_centos_7

00:06:04

failed #25593
build_stretch

00:02:44

 
Name Stage Failure
failed
build_centos_7 Build
make[1]: Leaving directory `/root/rpmbuild/centos-7/BUILD/lemonldap-ng-2.0.7/lemonldap-ng-portal'
make: *** [portal_test] Error 2
error: Bad exit status from /var/tmp/rpm-tmp.V6RlMW (%check)
Bad exit status from /var/tmp/rpm-tmp.V6RlMW (%check)


RPM build errors:
ci-build-pkg: rpmbuild failed
ERROR: Job failed: exit code 1
failed
build_bionic Build
make[1]: *** [portal_test] Error 2
dh_auto_test: make -j2 -O test returned exit code 2
debian/rules:20: recipe for target 'build' failed
make: *** [build] Error 25
dpkg-buildpackage: error: debian/rules build subprocess returned exit status 2
debuild: fatal error at line 1152:
dpkg-buildpackage -rfakeroot -us -uc -ui failed
ci-build-pkg: debuild failed
ERROR: Job failed: exit code 1
failed
build_buster Build
make[1]: *** [Makefile:397: portal_test] Error 2
make[1]: Leaving directory '/builds/lemonldap-ng/lemonldap-ng'
dh_auto_test: make -j2 test returned exit code 2
make: *** [debian/rules:20: build] Error 2
dpkg-buildpackage: error: debian/rules build subprocess returned exit status 2
debuild: fatal error at line 1182:
dpkg-buildpackage -us -uc -ui failed
ci-build-pkg: debuild failed
ERROR: Job failed: exit code 1
failed
build_stretch Build
make[1]: Leaving directory '/builds/lemonldap-ng/lemonldap-ng'
dh_auto_test: make -j2 test returned exit code 2
debian/rules:20: recipe for target 'build' failed
make: *** [build] Error 2
dpkg-buildpackage: error: debian/rules build gave error exit status 2
debuild: fatal error at line 1116:
dpkg-buildpackage -rfakeroot -us -uc failed
ci-build-pkg: debuild failed
ERROR: Job failed: exit code 1