WIP - Modify unit test to pass pipeline - To be confirmed (#1603)

6 jobs for master in 7 minutes and 57 seconds (queued for 3 seconds)
Status Job ID Name Coverage
  Build
failed #9856
build_bionic

00:02:36

failed #9855
build_buster

00:02:37

failed #9867
build_stretch

00:02:43

failed #9854
build_stretch

00:02:38

 
  Sign
skipped #9857
sign
 
  Deploy
skipped #9858
pages
 
Name Stage Failure
failed
build_stretch Build
make[1]: Leaving directory '/builds/lemonldap-ng/lemonldap-ng'
dh_auto_test: make -j2 test returned exit code 2
debian/rules:20: recipe for target 'build' failed
make: *** [build] Error 2
dpkg-buildpackage: error: debian/rules build gave error exit status 2
debuild: fatal error at line 1116:
dpkg-buildpackage -rfakeroot -us -uc failed
ci-build-pkg: debuild failed
ERROR: Job failed: exit code 1
failed
build_bionic Build
make[2]: Leaving directory '/builds/lemonldap-ng/lemonldap-ng/lemonldap-ng-portal'
dh_auto_test: make -j2 -O test returned exit code 2
debian/rules:20: recipe for target 'build' failed
make: *** [build] Error 25
dpkg-buildpackage: error: debian/rules build subprocess returned exit status 2
debuild: fatal error at line 1152:
dpkg-buildpackage -rfakeroot -us -uc -ui failed
ci-build-pkg: debuild failed
ERROR: Job failed: exit code 1
failed
build_buster Build
make[2]: Leaving directory '/builds/lemonldap-ng/lemonldap-ng/lemonldap-ng-portal'
make[1]: Leaving directory '/builds/lemonldap-ng/lemonldap-ng'
dh_auto_test: make -j2 test returned exit code 2
make: *** [debian/rules:20: build] Error 2
dpkg-buildpackage: error: debian/rules build subprocess returned exit status 2
debuild: fatal error at line 1182:
dpkg-buildpackage -us -uc -ui failed
ci-build-pkg: debuild failed
ERROR: Job failed: exit code 1