Merge branch 'v2.0'

9 jobs for master in 18 minutes and 58 seconds (queued for 11 minutes and 19 seconds)
Status Job ID Name Coverage
  Build
passed #19552
autopkgtest

00:02:25

passed #19556
build_bionic

00:05:11

passed #19554
build_buster

00:03:33

passed #19555
build_disco

00:04:04

failed #19584
build_stretch

00:03:43

failed #19565
build_stretch

00:03:46

failed #19553
build_stretch

00:03:43

 
  Sign
skipped #19557
sign
 
  Deploy
skipped #19558
pages
 
Name Stage Failure
failed
build_stretch Build
make[1]: Leaving directory '/builds/lemonldap-ng/lemonldap-ng'
dh_auto_test: make -j2 test returned exit code 2
debian/rules:20: recipe for target 'build' failed
make: *** [build] Error 2
dpkg-buildpackage: error: debian/rules build gave error exit status 2
debuild: fatal error at line 1116:
dpkg-buildpackage -rfakeroot -us -uc failed
ci-build-pkg: debuild failed
ERROR: Job failed: exit code 1