Merge branch 'v2.0'

7 jobs for master in 20 minutes and 16 seconds (queued for 5 seconds)
latest
Status Job ID Name Coverage
  Build
passed #19753
autopkgtest

00:02:25

passed #19757
build_bionic

00:05:24

passed #19755
build_buster

00:04:28

passed #19756
build_disco

00:04:09

failed #19754
build_stretch

00:03:49

 
  Sign
skipped #19758
sign
 
  Deploy
skipped #19759
pages
 
Name Stage Failure
failed
build_stretch Build
make[1]: Leaving directory '/builds/lemonldap-ng/lemonldap-ng'
dh_auto_test: make -j2 test returned exit code 2
debian/rules:20: recipe for target 'build' failed
make: *** [build] Error 2
dpkg-buildpackage: error: debian/rules build gave error exit status 2
debuild: fatal error at line 1116:
dpkg-buildpackage -rfakeroot -us -uc failed
ci-build-pkg: debuild failed
ERROR: Job failed: exit code 1