Allow setSecurity to be used in Combination (#2009)

Status Job ID Name Coverage
  Build
passed #20121
autopkgtest

00:02:16

passed #20125
build_bionic

00:04:57

passed #20123
build_buster

00:03:32

passed #20124
build_disco

00:04:05

failed #20127
build_stretch

00:03:38

failed #20126
build_stretch

00:03:45

failed #20122
build_stretch

00:03:46

 
Name Stage Failure
failed
build_stretch Build
make[1]: Leaving directory '/builds/lemonldap-ng/lemonldap-ng'
dh_auto_test: make -j2 test returned exit code 2
debian/rules:20: recipe for target 'build' failed
make: *** [build] Error 2
dpkg-buildpackage: error: debian/rules build gave error exit status 2
debuild: fatal error at line 1116:
dpkg-buildpackage -rfakeroot -us -uc failed
ci-build-pkg: debuild failed
ERROR: Job failed: exit code 1