Update traduction

7 jobs for certificateReset-1605 in 15 minutes and 53 seconds (queued for 4 seconds)
latest
Status Job ID Name Coverage
  Build
passed #21005
autopkgtest

00:02:39

failed #21009
build_bionic

00:02:31

failed #21007
build_buster

00:02:24

failed #21010
build_centos_7

00:03:24

failed #21008
build_disco

00:02:27

failed #21015
build_stretch

00:02:25

failed #21006
build_stretch

00:02:25

 
Name Stage Failure
failed
build_stretch Build
make[1]: Leaving directory '/builds/mamesene/lemonldap-ng'
dh_auto_test: make -j2 test returned exit code 2
debian/rules:20: recipe for target 'build' failed
make: *** [build] Error 2
dpkg-buildpackage: error: debian/rules build gave error exit status 2
debuild: fatal error at line 1116:
dpkg-buildpackage -rfakeroot -us -uc failed
ci-build-pkg: debuild failed
ERROR: Job failed: exit code 1
failed
build_centos_7 Build
=	
... using spectool
Getting https://release.ow2.org/lemonldap/lemonldap-ng-2.1.0.tar.gz to /builds/mamesene/lemonldap-ng/rpm/../lemonldap-ng-2.1.0.tar.gz
% Total % Received % Xferd Average Speed Time Time Time Current
Dload Upload Total Spent Left Speed
0 0 0 0 0 0 0 0 --:--:-- --:--:-- --:--:-- 0 0 0 0 0 0 0 0 0 --:--:-- --:--:-- --:--:-- 0 0 0 0 0 0 0 0 0 --:--:-- --:--:-- --:--:-- 0
curl: (22) The requested URL returned error: 404 Not Found
ci-build-pkg: spectool failed
ERROR: Job failed: exit code 1
failed
build_bionic Build
make[2]: Leaving directory '/builds/mamesene/lemonldap-ng/lemonldap-ng-portal'
dh_auto_test: make -j2 -O test returned exit code 2
debian/rules:20: recipe for target 'build' failed
make: *** [build] Error 25
dpkg-buildpackage: error: debian/rules build subprocess returned exit status 2
debuild: fatal error at line 1152:
dpkg-buildpackage -rfakeroot -us -uc -ui failed
ci-build-pkg: debuild failed
ERROR: Job failed: exit code 1
failed
build_disco Build
make[2]: Leaving directory '/builds/mamesene/lemonldap-ng/lemonldap-ng-portal'
make[1]: Leaving directory '/builds/mamesene/lemonldap-ng'
dh_auto_test: make -j2 test returned exit code 2
make: *** [debian/rules:20: build] Error 2
dpkg-buildpackage: error: debian/rules build subprocess returned exit status 2
debuild: fatal error at line 1182:
dpkg-buildpackage -us -uc -ui failed
ci-build-pkg: debuild failed
ERROR: Job failed: exit code 1
failed
build_buster Build
make[2]: Leaving directory '/builds/mamesene/lemonldap-ng/lemonldap-ng-portal'
make[1]: Leaving directory '/builds/mamesene/lemonldap-ng'
dh_auto_test: make -j2 test returned exit code 2
make: *** [debian/rules:20: build] Error 2
dpkg-buildpackage: error: debian/rules build subprocess returned exit status 2
debuild: fatal error at line 1182:
dpkg-buildpackage -us -uc -ui failed
ci-build-pkg: debuild failed
ERROR: Job failed: exit code 1