disl controller

16 jobs for reflection-api in 2 minutes and 53 seconds (queued for 3 seconds)
Status Job ID Name Coverage
  Build
failed #32697
build-10

00:00:21

failed #32698
build-11

00:00:24

failed #32699
build-12

00:00:21

failed #32700
build-13

00:00:24

failed #32701
build-14

00:00:33

canceled #32702
build-15

failed #32695
build-8

00:00:25

failed #32696
build-9

00:00:21

 
  Test
canceled #32705
test-10

canceled #32706
test-11

canceled #32707
test-12

canceled #32708
test-13

canceled #32709
test-14

canceled #32710
test-15

canceled #32703
test-8

canceled #32704
test-9

 
Name Stage Failure
failed
build-14 Build

build-disl-agent:

BUILD FAILED
/builds/mbasso/disl/build.xml:660: Warning: Could not find file /builds/mbasso/disl/src-disl-agent/linux-x86_64/libdislagent.so to copy.

Total time: 14 seconds
Cleaning up file based variables
ERROR: Job failed: exit code 1
failed
build-13 Build

build-disl-agent:

BUILD FAILED
/builds/mbasso/disl/build.xml:660: Warning: Could not find file /builds/mbasso/disl/src-disl-agent/linux-x86_64/libdislagent.so to copy.

Total time: 14 seconds
Cleaning up file based variables
ERROR: Job failed: exit code 1
failed
build-12 Build

build-disl-agent:

BUILD FAILED
/builds/mbasso/disl/build.xml:660: Warning: Could not find file /builds/mbasso/disl/src-disl-agent/linux-x86_64/libdislagent.so to copy.

Total time: 12 seconds
Cleaning up file based variables
ERROR: Job failed: exit code 1
failed
build-11 Build

build-disl-agent:

BUILD FAILED
/builds/mbasso/disl/build.xml:660: Warning: Could not find file /builds/mbasso/disl/src-disl-agent/linux-x86_64/libdislagent.so to copy.

Total time: 14 seconds
Cleaning up file based variables
ERROR: Job failed: exit code 1
failed
build-10 Build

build-disl-agent:

BUILD FAILED
/builds/mbasso/disl/build.xml:660: Warning: Could not find file /builds/mbasso/disl/src-disl-agent/linux-x86_64/libdislagent.so to copy.

Total time: 12 seconds
Cleaning up file based variables
ERROR: Job failed: exit code 1
failed
build-9 Build

build-disl-agent:

BUILD FAILED
/builds/mbasso/disl/build.xml:660: Warning: Could not find file /builds/mbasso/disl/src-disl-agent/linux-x86_64/libdislagent.so to copy.

Total time: 12 seconds
Cleaning up file based variables
ERROR: Job failed: exit code 1
failed
build-8 Build
Total time: 12 seconds
[cmd] sh exited 1
[cont-finish.d] executing container finish scripts...
[cont-finish.d] done.
[s6-finish] syncing disks.
[s6-finish] sending all processes the TERM signal.
[s6-finish] sending all processes the KILL signal and exiting.
Cleaning up file based variables
ERROR: Job failed: exit code 1