<?xml version="1.0" encoding="utf-8"?>
<!-- Generator: Adobe Illustrator 22.1.0, SVG Export Plug-In . SVG Version: 6.00 Build 0)  -->
<svg version="1.1" id="Layer_1" xmlns="http://www.w3.org/2000/svg" xmlns:xlink="http://www.w3.org/1999/xlink" x="0px" y="0px"
	 viewBox="0 0 585.8 264.7" style="enable-background:new 0 0 585.8 264.7;" xml:space="preserve">
<style type="text/css">
	.st0{fill:#992382;}
	.st1{fill:#F3F3F4;}
	.st2{fill:#20212C;}
</style>
<path class="st0" d="M585.8,117.3c0,12.4-10.1,22.5-22.5,22.5h-93.6c-12.4,0-22.5-10.1-22.5-22.5V22.5c0-12.4,10.1-22.5,22.5-22.5
	h93.6c12.4,0,22.5,10.1,22.5,22.5V117.3z"/>
<path class="st1" d="M470.6,77c0-1.5,0.8-2.7,1.8-3.9l0,0l38.3-41.6c1.5-1.7,3.6-2.6,5.7-2.6l0,0c2.1,0,4.2,0.9,5.7,2.6l0,0
	l38.3,41.6c1.1,1.2,1.8,2.4,1.8,3.9l0,0c0,1.2-0.7,2.5-1.7,3.1l0,0c-1,0.6-2.2,0.9-3.5,0.9l0,0h-17.7c-1.3,0-2.4,0.5-3.3,1.4l0,0
	c-0.8,0.8-1.4,2-1.4,3.3l0,0v15.7c0,4.6-3.7,8.3-8.3,8.3l0,0h-20c-4.6,0-8.3-3.7-8.3-8.3l0,0l0-15.7c0-1.3-0.5-2.4-1.4-3.3l0,0
	c-0.8-0.8-2-1.4-3.3-1.4l0,0h-17.7c-1.3,0-2.5-0.2-3.5-0.9l0,0C471.4,79.5,470.6,78.3,470.6,77L470.6,77
	C470.6,77.1,470.6,77.1,470.6,77L470.6,77L470.6,77z M557.8,75.6l-38.3-41.6c-0.9-0.9-1.9-1.4-3-1.4l0,0c-1.1,0-2.2,0.4-3,1.4l0,0
	l-38.3,41.6c-0.6,0.7-0.8,1.2-0.9,1.4l0,0c0,0,0,0,0,0l0,0c0.1,0.1,0.7,0.3,1.5,0.3l0,0h17.7c4.6,0,8.3,3.7,8.3,8.3l0,0v15.7
	c0,2.5,2.1,4.6,4.6,4.6l0,0h20c2.5,0,4.6-2.1,4.6-4.6l0,0l0-15.7c0-4.6,3.7-8.3,8.3-8.3l0,0l17.7,0c0.6,0,1-0.1,1.3-0.2l0,0
	c0.2-0.1,0.3-0.1,0.3-0.1l0,0C558.6,76.8,558.4,76.3,557.8,75.6L557.8,75.6L557.8,75.6z"/>
<path class="st2" d="M22.9,152c-2.6-2.1-5.6-3.2-9.1-3.2c-3.6,0-6.7,1-9.3,3.1c-2.8,2.3-4.2,5.1-4.2,8.7c0,3.7,1.4,6.6,4.1,8.8
	c2.5,2,5.6,3,9.4,3c8.9,0,13.3-3.9,13.3-11.8C27,157.1,25.7,154.2,22.9,152L22.9,152L22.9,152z M26.8,180.3c0.1-0.7,0.1-1.1,0.1-1.3
	c0-0.9-0.5-1.4-1.6-1.4c-1.3,0-3.3,0.1-5.9,0.3c-2.6,0.2-4.6,0.3-5.9,0.3c-1.3,0-3.3-0.1-5.9-0.4c-2.6-0.3-4.5-0.4-5.8-0.4
	c-1.2,0-1.8,0.5-1.8,1.4c0,0.2,0,0.7,0.1,1.4c1,7.6,1.5,17.8,1.5,30.6c0,3.2-0.1,7.9-0.2,14.1c-0.1,6.3-0.2,10.9-0.2,14.1
	c0,1.2,0,1.9,0.1,2c0.2,0.4,0.8,0.7,1.8,0.9c1.5,0.3,5,0.4,10.4,0.4c5.4,0,8.8-0.1,10.4-0.4c1.1-0.2,1.7-0.7,1.7-1.7
	c0-3.3-0.1-8.1-0.2-14.7c-0.1-6.5-0.2-11.4-0.2-14.7C25.3,199.3,25.8,189.1,26.8,180.3L26.8,180.3L26.8,180.3z M105.6,226.9
	c0-5.8-0.1-10.2-0.1-13.2v-21.6c0-5.6-2.1-9.9-6.4-13c-3.8-2.7-8.6-4.1-14.4-4.1c-4,0-8.7,1.6-14.1,4.7c-5.4,3.1-7.8,4.7-7.3,4.7
	c-0.5,0-0.9-1.5-1.2-4.6c-0.3-3-0.7-4.6-1.1-4.6c-0.9,0-5,0.7-12.1,2.1c-4.7,0.7-8.5,1.2-11.4,1.5c-0.7,0.3-1,0.8-1,1.5
	c0,0.3,0,0.6,0.1,1c1.8,6.4,2.6,15.2,2.6,26.5c0,3.6,0,8.9-0.1,16c-0.1,7.1-0.1,12.4-0.1,15.9c0,1.3,0.7,2,2.1,2.2
	c1.6,0.3,5,0.4,10.3,0.4c4.9,0,8.1-0.1,9.7-0.3c1.4-0.2,2.1-1,2.1-2.5v-36.6c0-1.7,1.3-3.4,3.8-5.1c2.3-1.5,4.4-2.3,6.2-2.3
	c5.4,0,8.1,3.1,8.1,9.3c0,1.7,0,4.2,0.1,7.5c0.1,3.3,0.1,5.8,0.1,7.5c0,2.2-0.1,5.4-0.2,9.7c-0.1,4.3-0.2,7.5-0.2,9.6
	c0,1.6,0.7,2.5,2,2.8c1.4,0.3,4.9,0.4,10.6,0.4c5.3,0,8.6-0.1,9.9-0.3c1.3-0.2,1.9-0.9,1.9-2.1C105.7,237.1,105.7,232.7,105.6,226.9
	L105.6,226.9z M181,179.3c-0.4-1.2-1.1-1.8-2.2-1.8c-1.1,0-2.7,0.1-4.9,0.3c-2.2,0.2-3.8,0.3-4.9,0.3c-1.1,0-2.7,0-4.8-0.1
	c-2.1,0-3.8-0.1-4.8-0.1c-0.9,0-1.4,0.7-1.4,2.1c0,1.3,0.1,3.2,0.4,5.9c0.3,2.6,0.4,4.6,0.4,5.9c0,4.6-0.2,8.4-0.5,11.7
	c-0.2,1.5-1.5,4.3-3.9,8.4c-2.5,4.4-4.3,6.6-5.4,6.6c-1.2,0-3.1-2.2-5.6-6.7c-2.5-4.2-3.8-7.1-3.9-8.7c-0.3-3-0.4-6.8-0.4-11.5
	c0-1.3,0.1-3.2,0.3-5.8c0.2-2.5,0.3-4.5,0.3-5.7c0-1.4-0.5-2.1-1.6-2.1c-2.3,0-5.8-0.1-10.4-0.2c-4.6-0.1-8.1-0.2-10.4-0.2
	c-1.6,0-2.4,0.6-2.4,1.8c0,1.8,0,4.5-0.1,8c-0.1,3.5-0.1,6.2-0.1,8c0,6.2,0.6,10.9,1.7,14c1,2.9,4.2,8.2,9.6,16.1
	c5,7.3,8.9,12.4,11.6,15.3c0.6,0.7,1.4,1.1,2.4,1.4c1.5,0.4,4.9,0.5,10,0.5c5.9,0,9.5-0.7,10.6-2.1c3.2-3.7,7.1-8.8,11.6-15.4
	c5.2-7.7,8.3-13.1,9.3-16.3c0.5-1.4,0.7-6,0.7-13.7C182.2,187.1,181.8,181.9,181,179.3L181,179.3L181,179.3z M244.4,182.7
	c-6.1-6.3-13.4-9.5-22.1-9.5c-10.3,0-18.6,3.4-24.8,10.3c-6.1,6.6-9.1,15.2-9.1,25.5c0,10.7,3.4,19.2,10.2,25.5
	c6.6,6.3,15.3,9.4,26,9.4c11.6,0,20.2-3,25.7-8.9c0.7-0.7,1-1.2,1-1.6c0-1.1-1.1-3.8-3.4-7.9c-2.2-4.2-3.8-6.5-4.8-6.9
	c-1.7,1.1-3.4,2.2-5.2,3.3c-4.1,2.2-8.1,3.2-12.1,3.2c-3.3,0-6.3-0.6-8.9-1.9c-3.2-1.5-5.1-3.8-5.8-6.7c10.6-0.8,18.5-1.5,23.8-2.1
	c8.9-0.9,13.5-1.4,14-1.5c2.9-0.6,4.4-3.2,4.4-7.8C253.5,196.5,250.4,189,244.4,182.7L244.4,182.7z M227.5,202.2
	c-7,1-12.2,1.6-15.6,1.6c-1.3,0-1.9-0.6-1.9-1.8c0-3,0.9-5.6,2.6-7.8c1.9-2.4,4.2-3.6,7-3.6c2.8,0,5.1,1.1,7.1,3.2
	c2,2.1,3,4.6,3,7.4C229.7,201.6,229,202,227.5,202.2L227.5,202.2L227.5,202.2z M328.2,226.9c0-5.8-0.1-10.2-0.1-13.2v-21.6
	c0-5.6-2.1-9.9-6.4-13c-3.8-2.7-8.6-4.1-14.4-4.1c-4,0-8.7,1.6-14.1,4.7c-5.4,3.1-7.8,4.7-7.3,4.7c-0.5,0-0.9-1.5-1.2-4.6
	c-0.3-3-0.7-4.6-1.1-4.6c-0.9,0-4.9,0.7-12.1,2.1c-4.7,0.7-8.5,1.2-11.4,1.5c-0.7,0.3-1,0.8-1,1.5c0,0.3,0,0.6,0.1,1
	c1.8,6.4,2.6,15.2,2.6,26.5c0,3.6,0,8.9-0.1,16c0,7.1-0.1,12.4-0.1,15.9c0,1.3,0.7,2,2.1,2.2c1.6,0.3,5,0.4,10.3,0.4
	c4.9,0,8.1-0.1,9.7-0.3c1.4-0.2,2.1-1,2.1-2.5v-36.6c0-1.7,1.3-3.4,3.8-5.1c2.3-1.5,4.4-2.3,6.2-2.3c5.4,0,8.1,3.1,8.1,9.3
	c0,1.7,0,4.2,0.1,7.5c0.1,3.3,0.1,5.8,0.1,7.5c0,2.2-0.1,5.4-0.2,9.7c-0.1,4.3-0.2,7.5-0.2,9.6c0,1.6,0.7,2.5,2,2.8
	c1.4,0.3,4.9,0.4,10.6,0.4c5.3,0,8.6-0.1,9.9-0.3c1.3-0.2,1.9-0.9,1.9-2.1C328.3,237.1,328.2,232.7,328.2,226.9L328.2,226.9z
	 M383.5,220.7c-0.9,0-2.3,0.3-4.4,0.8c-2.1,0.5-3.7,0.8-4.8,0.8c-3.6,0-6-1-7.2-2.9c-0.9-1.4-1.3-4.1-1.3-7.9c0-1,0-2.6-0.1-4.8
	c0-2.1,0-3.7,0-4.8c0-2,0.3-3,1-3h5.1c0.9,0,2.4,0,4.5,0.1c2.1,0.1,3.6,0.1,4.5,0.1c1.3,0,2-0.5,2-1.4c0-1.1,0-2.7-0.1-4.7
	c0-2.1-0.1-3.7-0.1-4.7c0-1,0.1-2.6,0.3-4.7c0.2-2.1,0.3-3.6,0.3-4.7c0-0.7-0.5-1-1.5-1c-1.6,0-4,0.1-7.2,0.2
	c-3.2,0.1-5.6,0.2-7.2,0.2c-1.3,0-2-1.1-2-3.3c0-1.9,0.1-4.6,0.4-8.3c0.3-3.7,0.4-6.4,0.4-8.2c0-0.7-0.6-1.1-1.7-1.2
	c-4.7-0.5-8.1-1-10.4-1.3c-1-0.1-2.8-0.4-5.4-1c-2.3-0.5-4-0.8-5.2-0.8c-1,0-1.5,2.6-1.5,7.9c0-0.3,0.1,2.5,0.3,8.3
	c0.1,3.7,0,6.4-0.3,8.1c-0.1,0.9-1,1.3-2.6,1.4c-2.9,0.1-4.3,0.6-4.3,1.5c0,1,0.1,2.4,0.2,4.3c0.1,1.9,0.2,3.4,0.2,4.3
	c0,0.7-0.1,1.8-0.2,3.3c-0.1,1.5-0.2,2.6-0.2,3.3c0,1.2,0.9,1.8,2.6,1.8c0.2,0,0.5,0,0.9-0.1c0.4,0,0.7,0,0.9,0c2.3,0,3.5,1,3.5,3
	c0,3-0.1,7.5-0.3,13.4c-0.2,6-0.3,10.5-0.3,13.4c0,10,6.5,15,19.6,15c7.1,0,13.6-1.6,19.4-4.8c1.2-0.7,2-1.2,2.2-1.6
	c0.3-0.4,0.4-1.2,0.4-2.5c0-1.3,0.2-3.3,0.5-6.1c0.3-2.8,0.5-4.8,0.5-6.2C384.9,221.2,384.4,220.7,383.5,220.7L383.5,220.7
	L383.5,220.7z M447.7,183.8c-6.3-6.4-14.6-9.6-24.8-9.6c-10.5,0-18.8,3.3-24.9,9.8c-6.1,6.5-9.2,15-9.2,25.5
	c0,9.9,3.2,18.1,9.6,24.4c6.4,6.3,14.6,9.5,24.5,9.5c10.3,0,18.5-3.2,24.8-9.6c6.3-6.4,9.5-14.8,9.5-25.1
	C457.2,198.5,454,190.2,447.7,183.8L447.7,183.8z M431.8,218.1c-2.3,2.8-5.2,4.2-8.7,4.2c-3.6,0-6.5-1.4-8.8-4.2
	c-2.2-2.6-3.2-5.8-3.2-9.4c0-3.6,1.1-6.7,3.2-9.3c2.3-2.8,5.2-4.2,8.8-4.2c3.5,0,6.4,1.4,8.6,4.1c2.2,2.7,3.3,5.9,3.3,9.4
	C435,212.4,433.9,215.5,431.8,218.1L431.8,218.1L431.8,218.1z M510.2,194.5c0-2.2-0.1-3.9-0.1-5.2c0-1.1,0.2-3,0.5-5.6
	c0.3-2.4,0.4-4.2,0.4-5.6c0-1.1-1.3-1.6-3.8-1.6c-4,0-8.2,1.2-12.5,3.6c-4.3,2.4-6.2,3.6-5.6,3.6c-0.6,0-1-1.4-1.2-4.3
	c-0.2-2.8-0.7-4.3-1.6-4.3c-0.2,0-3.9,0.7-11,2.1c-4.8,0.7-8.4,1.2-10.9,1.5c-0.7,0.2-1,0.7-1,1.4c0,0.3,0,0.6,0.1,1
	c1.9,6.9,2.9,15.6,2.9,26.2c0,3.6,0,9-0.1,16.2c0,7.2-0.1,12.6-0.1,16.2c0,1.3,0.7,2.1,2.2,2.2c2.6,0.3,6,0.4,10.3,0.4
	c4.5,0,7.8-0.1,10-0.3c1.5-0.1,2.2-0.7,2.2-1.8c0-1.3-0.1-3.2-0.3-5.8c-0.2-2.6-0.3-4.5-0.3-5.9c0-1.9,0-4.9-0.1-8.8
	c-0.1-4-0.1-6.9-0.1-8.8c0-3.6,0.7-5.9,2-7.1c1.4-1.2,3.9-1.8,7.7-1.8c0.8,0,2,0.1,3.7,0.2c1.6,0.1,2.9,0.2,3.8,0.2
	c1.9,0,2.9-0.9,2.9-2.6C510.3,199,510.3,197.2,510.2,194.5L510.2,194.5L510.2,194.5z M583.8,179.3c-0.4-1.2-1.2-1.8-2.4-1.8
	c-2.3,0-5.7,0.1-10.3,0.3c-4.6,0.2-8,0.3-10.3,0.3c-0.9,0-1.4,0.4-1.4,1.3c0,1.3,0.1,3.1,0.3,5.6c0.2,2.5,0.3,4.3,0.3,5.6
	c0,4.6-0.2,9-0.7,12.9c-0.2,1.4-1.4,4.3-3.7,8.5c-2.5,4.4-4.2,6.6-5.3,6.6c-1.2,0-3.2-2.2-5.9-6.7c-2.6-4.3-3.9-7.2-4.1-8.8
	c-0.2-2-0.3-5.9-0.3-11.6c0-1.3,0.1-3.2,0.2-5.7c0.1-2.5,0.2-4.5,0.2-5.7c0-1.4-0.5-2.1-1.4-2.1c-2.3,0-5.8-0.1-10.5-0.2
	c-4.7-0.1-8.2-0.2-10.5-0.2c-1.5,0-2.2,0.6-2.2,1.8c0,1.6,0,4.1-0.1,7.3c-0.1,3.3-0.1,5.7-0.1,7.4c0,8,0.2,12.7,0.5,14
	c0.6,2.3,4.1,7.8,10.5,16.5c6.1,8.5,9.2,13,9.2,13.5c0,5.7-6.3,8.6-18.8,8.6c-0.8,0-1.2,0.4-1.2,1.3c0,0.8,0.5,2.3,1.6,4.7
	c0.7,1.6,1.4,3.2,2.2,4.8c0.9,2.5,1.6,4.7,2.2,6.6c0.7,0.5,2,0.7,3.9,0.7c12.8,0,19.7-0.3,20.8-1c0.9-0.5,4.7-5.2,11.3-14
	c6-8,9.7-13.2,11.2-15.4c9.2-14.1,14.2-22.3,14.8-24.5c0.5-1.9,0.8-7.2,0.8-16C584.8,186.2,584.5,181.4,583.8,179.3L583.8,179.3
	L583.8,179.3z"/>
<path class="st0" d="M138.8,108.9c0,8.6-2.6,16-7.7,22.2c-5.1,6.2-11.2,9.3-18.4,9.3H26c-7.3,0-13.4-3-18.5-9.2
	c-5-6.1-7.6-13.6-7.6-22.4v-42c0-8.8,2.5-16.3,7.6-22.4c5-6.1,11.2-9.2,18.5-9.2h86.8c7.1,0,13.2,3.1,18.4,9.3
	c5.1,6.2,7.7,13.6,7.7,22.2V108.9L138.8,108.9z M121.5,108.9v-42c0-2.9-0.9-5.4-2.6-7.4c-1.7-2.1-3.7-3.1-6.1-3.1h-87
	c-2.4,0-4.4,1-6,3.1c-1.6,2.1-2.4,4.5-2.4,7.4v42c0,7,2.9,10.5,8.7,10.5h86.8c2.4,0,4.4-1,6.1-3.1
	C120.6,114.3,121.5,111.8,121.5,108.9L121.5,108.9z"/>
<path class="st0" d="M286.3,140.4H173.5c-7.1,0-13.2-3.1-18.2-9.3c-5-6.2-7.6-13.6-7.6-22.2v-42c0-8.6,2.5-16,7.6-22.2
	c5-6.2,11.1-9.3,18.2-9.3h112.8v31.5h-17.4c0-7-2.9-10.5-8.7-10.5h-86.8c-2.4,0-4.4,1-6.1,3.1c-1.7,2.1-2.6,4.5-2.6,7.4v42
	c0,2.9,0.8,5.3,2.6,7.4c1.7,2.1,3.7,3.1,6.1,3.1h86.8c5.8,0,8.7-3.5,8.7-10.5h17.4V140.4L286.3,140.4z"/>
<path class="st0" d="M425.1,108.9c0,8.8-2.5,16.3-7.6,22.4c-5,6.1-11.2,9.2-18.5,9.2H295.2v-31.5h17.1c0,7,2.9,10.5,8.7,10.5h78.1
	c2.4,0,4.4-1,6.1-3.1c1.7-2.1,2.6-4.5,2.6-7.4c0-2.9-0.9-5.3-2.6-7.4c-1.7-2.1-3.7-3.1-6.1-3.1H321c-7.1,0-13.2-3.1-18.2-9.3
	c-5-6.2-7.6-13.6-7.6-22.2c0-8.6,2.5-16,7.6-22.2c5-6.2,11.1-9.3,18.2-9.3h104.1v31.5h-17.4c0-7-2.9-10.5-8.7-10.5H321
	c-2.4,0-4.4,1-6.1,3.1c-1.7,2.1-2.6,4.5-2.6,7.4c0,2.9,0.9,5.3,2.6,7.4c1.7,2.1,3.7,3.1,6.1,3.1h78.1c7.3,0,13.4,3.1,18.5,9.2
	C422.6,92.7,425.1,100.1,425.1,108.9L425.1,108.9z"/>
</svg>
