Use master instead of tagged version

4 jobs for master in 41 minutes and 24 seconds (queued for 4 seconds)
latest
Status Job ID Name Coverage
  Clone
passed clonerepo #60552
scancode

00:00:03

 
  Scan
passed scancode #60553
scancode

00:41:12

 
  Test
failed test #60554

00:00:09

 
  Sonar
skipped sonar #60555
 
Name Stage Failure
failed
test Test
    at org.codehaus.plexus.classworlds.launcher.Launcher.main (Launcher.java:347)
[ERROR]
[ERROR] Re-run Maven using the -X switch to enable full debug logging.
[ERROR]
[ERROR] For more information about the errors and possible solutions, please read the following articles:
[ERROR] [Help 1] http://cwiki.apache.org/confluence/display/MAVEN/ProjectBuildingException
[ERROR] [Help 2] http://cwiki.apache.org/confluence/display/MAVEN/UnresolvableModelException
Cleaning up file based variables
ERROR: Job failed: exit code 1