Shanghai
Buenos Aires
Bombay
Karachi
Mexico
Delhi
Manila
Moskva
Dhaka
Seoul
Istanbul
Sao Paulo
Ogoyo
Jakarta
Krung Thep
Tokyo
East New York
New York
Taipei
Kinshasa
Lima
Cairo
Beijing
London
Tehran
Bogota
Hong Kong
Lahore
Rio de Janeiro
Baghdad
Bangkok
Bangalore
Santiago
Calcutta
Toronto
Rangoon
Sydney
Madras
Riyadh
Wuhan
Saint Petersburg
Chongqing
Chengdu
Alexandria
Tianjin
Melbourne
Ahmadabad
Los Angeles
Pusan
Abidjan
Kano
Hyderabad
Yokohama
Ibadan
Singapore
Ankara
Shenyang
Ho Chi Minh City
Cape Town
Berlin
Montreal
Harbin
Pyongyang
Guangzhou
Casablanca
Durban
Madrid
Nanjing
Kabul
Pune
Surat
Jiddah
Chicago
Kanpur
Luanda
Addis Ababa
Nairobi
Taiyuan
Salvador
Jaipur
Dar es Salaam
Osaka
Mogadishu
Taegu
Rome
Changchun
Kiїv
Faisalabad
Izmir
Dakar
Lucknow
Al Jizah
Cali
Surabaya
Belo Horizonte
Grand Dakar
Mashhad
Nagpur
Brasilia
Santo Domingo
Nagoya
Havana
Paris
Changsha
Jinan
Al Mawsil al Jadidah
Dalian
Houston
Johannesburg
Al Basrah al Qadimah
Zhengzhou
Medellin
Shijiazhuang
Tashkent
Algiers
Khartoum
Accra
Guayaquil
Beirut
Sapporo
Jilin
Hangzhou
Bucharest
Nanchang
Camayenne
South Brisbane
Vancouver
Indore
Caracas
Ecatepec
Sanaa
Conakry
Medan
Rawalpindi
Minsk
Hamburg
Curitiba
Budapest
Bandung
Soweto
Rabat
Warsaw
Qingdao
Guadalajara
Pretoria
Aleppo
Patna
Bhopal
Manaus
Tangshan
Xinyang
Kaduna
Barcelona
Phnom Penh
Damascus
Vienna
Esfahan
Ludhiana
Harare
Kobe
Bekasi
Philadelphia
Urumqi
Asuncion
Recife
Taejon
Kumasi
Kyoto
Kuala Lumpur
Karaj
Perth
Multan
Hanoi
Kharkiv
Agra
Cordoba
Tabriz
Novosibirsk
Kwangju
Bursa
Vadodara
Belem
Fushun
Quito
Fukuoka
Puebla de Zaragoza
Antananarivo
Luoyang
Hefei
Hyderabad
Valencia
Gujranwala
Barranquilla
Tijuana
Lubumbashi
Porto Alegre
Tangerang
Santa Cruz de la Sierra
Handan
Kampala