Own all dirs in perl modules installation path

3 jobs for <span class="ref-name">specfile_cleanup</span> in 1 minute and 6 seconds (queued for 4 seconds)
Status Job ID Name Coverage
  Build
failed #8811
build_bionic

00:00:22

failed #8810
build_stretch

00:00:43

 
  Sign
skipped #8812
sign
 
Name Stage Failure
failed
build_bionic Build
dh_gencontrol: dpkg-gencontrol -plemonldap-ng-build-deps -ldebian/changelog -Tdebian/lemonldap-ng-build-deps.substvars -Pdebian/lemonldap-ng-build-deps returned exit code 255
dh_gencontrol: Aborting due to earlier error
debian/rules:20: recipe for target 'binary-indep' failed
make: *** [binary-indep] Error 25
Error in the build process: exit status 2
dpkg: error: cannot access archive 'lemonldap-ng-build-deps_unknown_all.deb': No such file or directory
mk-build-deps: dpkg --unpack failed
ci-build-pkg: mk-build-deps failed
ERROR: Job failed: exit code 1
failed
build_stretch Build
dpkg-gencontrol: error: invalid source version unknown
dh_gencontrol: dpkg-gencontrol -plemonldap-ng-build-deps -ldebian/changelog -Tdebian/lemonldap-ng-build-deps.substvars -Pdebian/lemonldap-ng-build-deps returned exit code 255
debian/rules:20: recipe for target 'binary-indep' failed
make: *** [binary-indep] Error 2
Error in the build process: exit status 2
dpkg: error: cannot access archive 'lemonldap-ng-build-deps_unknown_all.deb': No such file or directory
mk-build-deps: dpkg --unpack failed
ci-build-pkg: mk-build-deps failed
ERROR: Job failed: exit code 1