"drawer_background_1";"https://commons.wikimedia.org/wiki/File:Camion_citerne_à_Pforzheim.jpg?uselang=fr";"Paralacre";"CC0 1.0";"La personne qui a associé une œuvre avec cet acte l’a placée dans le domaine public en renonçant mondialement à tous ses droits sur cette œuvre en vertu des lois relatives au droit d’auteur, ainsi qu’à tous les droits juridiques connexes et voisins qu’elle possédait sur l’œuvre, sans autre limite que celles imposées par la loi. Vous pouvez copier, modifier, distribuer et utiliser cette œuvre, y compris à des fins commerciales, sans qu’il soit nécessaire d’en demander la permission."
"drawer_background_2";"https://commons.wikimedia.org/wiki/File:Camion_citerne_%C3%A0_carburants-Coignet-08.jpg?uselang=fr";"François GOGLINS";"CC BY-SA 4.0";"Vous êtes libre de partager, de copier, distribuer et transmettre cette œuvre, d’adapter, de modifier cette œuvre. Sous les conditions suivantes : paternité – Vous devez citer le nom de l’auteur original de la manière indiquée par l’auteur de l’œuvre ou le titulaire des droits qui vous confère cette autorisation (mais pas d’une manière qui suggérerait qu’il vous soutienne ou approuve votre utilisation de l’œuvre). Partage à l’identique – Si vous modifiez, transformez, ou vous basez sur cette œuvre, vous devez distribuer l’œuvre résultante sous la même licence ou une licence similaire à celle-ci."
"drawer_background_3";"https://commons.wikimedia.org/wiki/File:Jelcz_fuel_tank_truck_at_the_Muzeum_Polskiej_Techniki_Wojskowej_in_Warsaw_(2).JPG?uselang=fr";"SuperTank17";"CC BY-SA 3.0";"Vous êtes libre de partager, de copier, distribuer et transmettre cette œuvre, d’adapter, de modifier cette œuvre. Sous les conditions suivantes : paternité – Vous devez citer le nom de l’auteur original de la manière indiquée par l’auteur de l’œuvre ou le titulaire des droits qui vous confère cette autorisation (mais pas d’une manière qui suggérerait qu’il vous soutienne ou approuve votre utilisation de l’œuvre). Partage à l’identique – Si vous modifiez, transformez, ou vous basez sur cette œuvre, vous devez distribuer l’œuvre résultante sous la même licence ou une licence similaire à celle-ci."
"drawer_background_4";"https://commons.wikimedia.org/wiki/File:Renault_T_460,_fuel_tank_truck.jpg?uselang=fr";"Cjp24";"CC BY-SA 4.0";"Vous êtes libre de partager, de copier, distribuer et transmettre cette œuvre, d’adapter, de modifier cette œuvre. Sous les conditions suivantes : paternité – Vous devez citer le nom de l’auteur original de la manière indiquée par l’auteur de l’œuvre ou le titulaire des droits qui vous confère cette autorisation (mais pas d’une manière qui suggérerait qu’il vous soutienne ou approuve votre utilisation de l’œuvre). Partage à l’identique – Si vous modifiez, transformez, ou vous basez sur cette œuvre, vous devez distribuer l’œuvre résultante sous la même licence ou une licence similaire à celle-ci."
"drawer_background_5";"https://commons.wikimedia.org/wiki/File:Scania_R440,_fuel_tank_truck.jpg?uselang=fr";"Cjp24";"CC BY-SA 4.0";"Vous êtes libre de partager, de copier, distribuer et transmettre cette œuvre, d’adapter, de modifier cette œuvre. Sous les conditions suivantes : paternité – Vous devez citer le nom de l’auteur original de la manière indiquée par l’auteur de l’œuvre ou le titulaire des droits qui vous confère cette autorisation (mais pas d’une manière qui suggérerait qu’il vous soutienne ou approuve votre utilisation de l’œuvre). Partage à l’identique – Si vous modifiez, transformez, ou vous basez sur cette œuvre, vous devez distribuer l’œuvre résultante sous la même licence ou une licence similaire à celle-ci."
"drawer_background_6";"https://commons.wikimedia.org/wiki/File:Camion_collecteur_de_lubrifiants_usag%C3%A9s_%C3%A0_Martin.jpg?uselang=fr";"François GOGLINS";"CC BY-SA 4.0";"Vous êtes libre de partager, de copier, distribuer et transmettre cette œuvre, d’adapter, de modifier cette œuvre. Sous les conditions suivantes : paternité – Vous devez citer le nom de l’auteur original de la manière indiquée par l’auteur de l’œuvre ou le titulaire des droits qui vous confère cette autorisation (mais pas d’une manière qui suggérerait qu’il vous soutienne ou approuve votre utilisation de l’œuvre). Partage à l’identique – Si vous modifiez, transformez, ou vous basez sur cette œuvre, vous devez distribuer l’œuvre résultante sous la même licence ou une licence similaire à celle-ci."
"drawer_background_7";"https://stocksnap.io/photo/QWREJSNUGB";"Andrzej";"CC0 1.0";"La personne qui a associé une œuvre avec cet acte l’a placée dans le domaine public en renonçant mondialement à tous ses droits sur cette œuvre en vertu des lois relatives au droit d’auteur, ainsi qu’à tous les droits juridiques connexes et voisins qu’elle possédait sur l’œuvre, sans autre limite que celles imposées par la loi. Vous pouvez copier, modifier, distribuer et utiliser cette œuvre, y compris à des fins commerciales, sans qu’il soit nécessaire d’en demander la permission."
"drawer_background_8";"https://stocksnap.io/photo/L05LPK1M02";"Seb Creativo";"CC0 1.0";"La personne qui a associé une œuvre avec cet acte l’a placée dans le domaine public en renonçant mondialement à tous ses droits sur cette œuvre en vertu des lois relatives au droit d’auteur, ainsi qu’à tous les droits juridiques connexes et voisins qu’elle possédait sur l’œuvre, sans autre limite que celles imposées par la loi. Vous pouvez copier, modifier, distribuer et utiliser cette œuvre, y compris à des fins commerciales, sans qu’il soit nécessaire d’en demander la permission."
"drawer_background_9";"https://stocksnap.io/photo/U02UKEL04U";"Robson Hatsukami Morgan";"CC0 1.0";"La personne qui a associé une œuvre avec cet acte l’a placée dans le domaine public en renonçant mondialement à tous ses droits sur cette œuvre en vertu des lois relatives au droit d’auteur, ainsi qu’à tous les droits juridiques connexes et voisins qu’elle possédait sur l’œuvre, sans autre limite que celles imposées par la loi. Vous pouvez copier, modifier, distribuer et utiliser cette œuvre, y compris à des fins commerciales, sans qu’il soit nécessaire d’en demander la permission."
"drawer_background_10";"https://stocksnap.io/photo/AOEI2XN99G";"Markus Spiske";"CC0 1.0";"La personne qui a associé une œuvre avec cet acte l’a placée dans le domaine public en renonçant mondialement à tous ses droits sur cette œuvre en vertu des lois relatives au droit d’auteur, ainsi qu’à tous les droits juridiques connexes et voisins qu’elle possédait sur l’œuvre, sans autre limite que celles imposées par la loi. Vous pouvez copier, modifier, distribuer et utiliser cette œuvre, y compris à des fins commerciales, sans qu’il soit nécessaire d’en demander la permission."
"flag_albania";"https://commons.wikimedia.org/wiki/File:Flag_of_Albania.svg?uselang=fr";"Dbenbenn";"Domaine public";"Ce document n'est pas soumis au droit d'auteur et est donc dans le domaine public, car il est composé exclusivement d'informations qui sont dans le domaine public et ne contient aucune modification qui en ferait une œuvre originale."
"flag_andorra";"https://commons.wikimedia.org/wiki/File:Flag_of_Andorra.svg?uselang=fr";"HansenBCN";"Domaine public";"Moi, propriétaire du copyright de cette œuvre, la place dans le domaine public. Ceci s'applique dans le monde entier.\nDans certains pays, ceci peut ne pas être possible, dans ce cas : J'accorde à toute personne le droit d'utiliser cette œuvre dans n'importe quel but, sans aucune condition, sauf celles requises par la loi."
"flag_austria";"https://commons.wikimedia.org/wiki/File:Flag_of_Austria.svg?uselang=fr";"Bundesministerium für Landesverteidigung";"Domaine public";"Ce fichier est dans le domaine public selon la loi Autrichienne car il fait partie d’une loi, ordonnance ou décret officiel émis par une autorité fédérale ou d’État, ou car il est principalement d’usage officiel."
"flag_azerbaijan";"https://commons.wikimedia.org/wiki/File:Flag_of_Azerbaijan.svg?uselang=fr";"Skopp";"Domaine public";"Ce fichier est dans le domaine public selon la loi de l’Azerbaijan car il fait partie d’une loi, ordonnance ou décret officiel émis par une autorité fédérale ou d’État, ou car il est principalement d’usage officiel."
"flag_belarus";"https://commons.wikimedia.org/wiki/File:Flag_of_Belarus.svg?uselang=fr";"Zscout370";"Domaine public";"Cette œuvre a été placée dans le domaine public par son auteur, Zscout370. Ceci s'applique dans le monde entier. Dans certains pays, ceci peut ne pas être possible , dans ce cas : Zscout370 accorde à toute personne le droit d'utiliser cette œuvre dans n'importe quel but, sans aucune condition, sauf celles requises par la loi."
"flag_belgium";"https://commons.wikimedia.org/wiki/File:Flag_of_Belgium_(civil).svg?uselang=fr";;"Domaine public";"Cette image de géométrie simple est inéligible au droit d'auteur et par conséquent est dans le domaine public, parce qu'elle est intégralement constituée d'éléments qui font partie du patrimoine public."
"flag_bosnia_herzegovina";"https://commons.wikimedia.org/wiki/File:Flag_of_Bosnia_and_Herzegovina.svg?uselang=fr";"Kseferovic";"Domaine public";"Moi, propriétaire du copyright de cette œuvre, la place dans le domaine public. Ceci s'applique dans le monde entier. Dans certains pays, ceci peut ne pas être possible , dans ce cas : J'accorde à toute personne le droit d'utiliser cette œuvre dans n'importe quel but, sans aucune condition, sauf celles requises par la loi."
"flag_bulgaria";"https://commons.wikimedia.org/wiki/File:Flag_of_Bulgaria.svg?uselang=fr";"SKopp";"Domaine public";"Moi, propriétaire du copyright de cette œuvre, la place dans le domaine public. Ceci s'applique dans le monde entier. Dans certains pays, ceci peut ne pas être possible , dans ce cas : J'accorde à toute personne le droit d'utiliser cette œuvre dans n'importe quel but, sans aucune condition, sauf celles requises par la loi."
"flag_croatia";"https://commons.wikimedia.org/wiki/File:Flag_of_Croatia.svg?uselang=fr";"Nightstallion, Elephantus, Neoneo13, Denelson83, Rainman, R-41, Minestrone, Lupo, Zscout370, MaGa";"CC0 1.0";"Don universel au domaine public. La personne qui a associé une œuvre avec cet acte l’a placée dans le domaine public en renonçant mondialement à tous ses droits sur cette œuvre en vertu des lois relatives au droit d’auteur, ainsi qu’à tous les droits juridiques connexes et voisins qu’elle possédait sur l’œuvre, sans autre limite que celles imposées par la loi. Vous pouvez copier, modifier, distribuer et utiliser cette œuvre, y compris à des fins commerciales, sans qu’il soit nécessaire d’en demander la permission."
"flag_cyprus";"https://commons.wikimedia.org/wiki/File:Flag_of_Cyprus.svg?uselang=fr";"Vzb83";"Domaine public";"Ce document n'est pas soumis au droit d'auteur et est donc dans le domaine public, car il est composé exclusivement d'informations qui sont dans le domaine public et ne contient aucune modification qui en ferait une œuvre originale."
"flag_czech_republic";"https://commons.wikimedia.org/wiki/File:Flag_of_the_Czech_Republic.svg?uselang=fr";"Phroziac";"Domaine public";"Cette œuvre a été placée dans le domaine public par son auteur, Phroziac. Ceci s'applique dans le monde entier. Dans certains pays, ceci peut ne pas être possible , dans ce cas : Phroziac accorde à toute personne le droit d'utiliser cette œuvre dans n'importe quel but, sans aucune condition, sauf celles requises par la loi."
"flag_denmark";"https://commons.wikimedia.org/wiki/File:Flag_of_Denmark.svg?uselang=fr";"Madden";"Domaine public";"Cette image de géométrie simple est inéligible au droit d'auteur et par conséquent est dans le domaine public, parce qu'elle est intégralement constituée d'éléments qui font partie du patrimoine public."
"flag_estonia";"https://commons.wikimedia.org/wiki/File:Flag_of_Estonia.svg?uselang=fr";"Skopp, PeepP";"Domaine public";"Ce fichier est dans le domaine public selon la loi estonienne car il fait partie d’une loi, ordonnance ou décret officiel émis par une autorité fédérale ou d’État, ou car il est principalement d’usage officiel."
"flag_finland";"https://commons.wikimedia.org/wiki/File:Flag_of_Finland.svg?uselang=fr";"Sebastian Koppehel";"Domaine public";"Cette image de géométrie simple est inéligible au droit d'auteur et par conséquent est dans le domaine public, parce qu'elle est intégralement constituée d'éléments qui font partie du patrimoine public."
"flag_france";"https://commons.wikimedia.org/wiki/File:Flag_of_France.svg?uselang=fr";"SKopp";"Domaine public";"Cette image de géométrie simple est inéligible au droit d'auteur et par conséquent est dans le domaine public, parce qu'elle est intégralement constituée d'éléments qui font partie du patrimoine public."
"flag_georgia";"https://commons.wikimedia.org/wiki/File:Flag_of_Georgia.svg?uselang=fr";"Skopp";"Domaine public";"Cette image de géométrie simple est inéligible au droit d'auteur et par conséquent est dans le domaine public, parce qu'elle est intégralement constituée d'éléments qui font partie du patrimoine public."
"flag_germany";"https://commons.wikimedia.org/wiki/File:Flag_of_Germany.svg?uselang=fr";"Skopp, Madden";"Domaine public";"Cette image de géométrie simple est inéligible au droit d'auteur et par conséquent est dans le domaine public, parce qu'elle est intégralement constituée d'éléments qui font partie du patrimoine public."
"flag_greece";"https://commons.wikimedia.org/wiki/File:Flag_of_Greece.svg?uselang=fr";"-xfi-";"Domaine public";"Ce document n'est pas soumis au droit d'auteur et est donc dans le domaine public, car il est composé exclusivement d'informations qui sont dans le domaine public et ne contient aucune modification qui en ferait une œuvre originale."
"flag_hungary";"https://commons.wikimedia.org/wiki/File:Flag_of_Hungary.svg?uselang=fr";"Skopp";"Domaine public";"Ce document n'est pas soumis au droit d'auteur et est donc dans le domaine public, car il est composé exclusivement d'informations qui sont dans le domaine public et ne contient aucune modification qui en ferait une œuvre originale."
"flag_iceland";"https://commons.wikimedia.org/wiki/File:Flag_of_Iceland.svg?uselang=fr";"Árni Dagur, Magasjukur2";"Domaine public";"Cette image de géométrie simple est inéligible au droit d'auteur et par conséquent est dans le domaine public, parce qu'elle est intégralement constituée d'éléments qui font partie du patrimoine public."
"flag_ireland";"https://commons.wikimedia.org/wiki/File:Flag_of_Ireland.svg?uselang=fr";"Skopp";"Domaine public";"Moi, propriétaire du copyright de cette œuvre, la place dans le domaine public. Ceci s'applique dans le monde entier. Dans certains pays, ceci peut ne pas être possible , dans ce cas : J'accorde à toute personne le droit d'utiliser cette œuvre dans n'importe quel but, sans aucune condition, sauf celles requises par la loi."
"flag_italy";"https://commons.wikimedia.org/wiki/File:Flag_of_Italy.svg?uselang=fr";;"Domaine public";"Cette image de géométrie simple est inéligible au droit d'auteur et par conséquent est dans le domaine public, parce qu'elle est intégralement constituée d'éléments qui font partie du patrimoine public."
"flag_kazakhstan";"https://commons.wikimedia.org/wiki/File:Flag_of_Kazakhstan.svg?uselang=fr";"-xfi-";"Domaine public";"Ce fichier est dans le domaine public selon la loi Kazakh car il fait partie d’une loi, ordonnance ou décret officiel émis par une autorité fédérale ou d’État, ou car il est principalement d’usage officiel."
"flag_latvia";"https://commons.wikimedia.org/wiki/File:Flag_of_Latvia.svg?uselang=fr";"Skopp";"Domaine public";"Moi, propriétaire du copyright de cette œuvre, la place dans le domaine public. Ceci s'applique dans le monde entier. Dans certains pays, ceci peut ne pas être possible , dans ce cas : J'accorde à toute personne le droit d'utiliser cette œuvre dans n'importe quel but, sans aucune condition, sauf celles requises par la loi."
"flag_liechtenstein";"https://commons.wikimedia.org/wiki/File:Flag_of_Liechtenstein.svg?uselang=fr";"Mnmazur";"Domaine public";"Moi, propriétaire du copyright de cette œuvre, la place dans le domaine public. Ceci s'applique dans le monde entier. Dans certains pays, ceci peut ne pas être possible , dans ce cas : J'accorde à toute personne le droit d'utiliser cette œuvre dans n'importe quel but, sans aucune condition, sauf celles requises par la loi."
"flag_lithuania";"https://commons.wikimedia.org/wiki/File:Flag_of_Lithuania.svg?uselang=fr";"Skopp";"Domaine public";"Cette image de géométrie simple est inéligible au droit d'auteur et par conséquent est dans le domaine public, parce qu'elle est intégralement constituée d'éléments qui font partie du patrimoine public."
"flag_luxembourg";"https://commons.wikimedia.org/wiki/File:Flag_of_Luxembourg.svg?uselang=fr";"Skopp";"Domaine public";"Moi, propriétaire du copyright de cette œuvre, la place dans le domaine public. Ceci s'applique dans le monde entier. Dans certains pays, ceci peut ne pas être possible , dans ce cas : J'accorde à toute personne le droit d'utiliser cette œuvre dans n'importe quel but, sans aucune condition, sauf celles requises par la loi."
"flag_macedonia";"https://commons.wikimedia.org/wiki/File:Flag_of_Macedonia.svg?uselang=fr";"Skopp";"Domaine public";"Moi, propriétaire du copyright de cette œuvre, la place dans le domaine public. Ceci s'applique dans le monde entier. Dans certains pays, ceci peut ne pas être possible , dans ce cas : J'accorde à toute personne le droit d'utiliser cette œuvre dans n'importe quel but, sans aucune condition, sauf celles requises par la loi."
"flag_malta";"https://commons.wikimedia.org/wiki/File:Flag_of_Malta.svg?uselang=fr";"Open Clip Art Library";"CC0 1.0";"Don universel au domaine public. La personne qui a associé une œuvre avec cet acte l’a placée dans le domaine public en renonçant mondialement à tous ses droits sur cette œuvre en vertu des lois relatives au droit d’auteur, ainsi qu’à tous les droits juridiques connexes et voisins qu’elle possédait sur l’œuvre, sans autre limite que celles imposées par la loi. Vous pouvez copier, modifier, distribuer et utiliser cette œuvre, y compris à des fins commerciales, sans qu’il soit nécessaire d’en demander la permission."
"flag_moldova";"https://commons.wikimedia.org/wiki/File:Flag_of_Moldova.svg?uselang=fr";"Nameneko";"Domaine public";"Ce fichier est dans le domaine public selon la loi Moldave car il fait partie d’une loi, ordonnance ou décret officiel émis par une autorité fédérale ou d’État, ou car il est principalement d’usage officiel."
"flag_montenegro";"https://commons.wikimedia.org/wiki/File:Flag_of_Montenegro.svg?uselang=fr";"B1mbo, Froztbyte";"Domaine public";"Ce fichier est dans le domaine public selon la loi du Montenegro car il fait partie d’une loi, ordonnance ou décret officiel émis par une autorité fédérale ou d’État, ou car il est principalement d’usage officiel."
"flag_morocco";"https://commons.wikimedia.org/wiki/File:Flag_of_Morocco.svg?uselang=fr";"Denelson83, Zscout370";"Domaine public";"Moi, propriétaire du copyright de cette œuvre, la place dans le domaine public. Ceci s'applique dans le monde entier. Dans certains pays, ceci peut ne pas être possible , dans ce cas : J'accorde à toute personne le droit d'utiliser cette œuvre dans n'importe quel but, sans aucune condition, sauf celles requises par la loi."
"flag_netherlands";"https://commons.wikimedia.org/wiki/File:Flag_of_the_Netherlands.svg?uselang=fr";"Zscout370";"Domaine public";"Cette œuvre a été placée dans le domaine public par son auteur, Zscout370. Ceci s'applique dans le monde entier. Dans certains pays, ceci peut ne pas être possible , dans ce cas : Zscout370 accorde à toute personne le droit d'utiliser cette œuvre dans n'importe quel but, sans aucune condition, sauf celles requises par la loi."
"flag_norway";"https://commons.wikimedia.org/wiki/File:Flag_of_Norway.svg?uselang=fr";"Dbenbenn";"Domaine public";"Cette image de géométrie simple est inéligible au droit d'auteur et par conséquent est dans le domaine public, parce qu'elle est intégralement constituée d'éléments qui font partie du patrimoine public."
"flag_poland";"https://commons.wikimedia.org/wiki/File:Flag_of_Poland.svg?uselang=fr";;"Domaine public";"Cette image de géométrie simple est inéligible au droit d'auteur et par conséquent est dans le domaine public, parce qu'elle est intégralement constituée d'éléments qui font partie du patrimoine public."
"flag_portugal";"https://commons.wikimedia.org/wiki/File:Flag_of_Portugal.svg?uselang=fr";"Columbano Bordalo Pinheiro, Vítor Luís Rodrigues, António Martins-Tuválkin";"Domaine public";"Cette œuvre est également dans le domaine public dans tous les pays pour lesquels le copyright a une durée de vie de 70 ans ou moins après la mort de l'auteur. Cette œuvre est dans le domaine public aux États-Unis car elle a été publiée avant le 1er janvier 1923."
"flag_romania";"https://commons.wikimedia.org/wiki/File:Flag_of_Romania.svg?uselang=fr";"AdiJapan";"Domaine public";"Cette image représente un symbole officiel de l'État roumain ou de l'une de ces autorités publiques organisation. Ce symbole peut par exemple être des armoiries, un sceau, un drapeau, une emblème ou n'importe quel insigne. D'après la loi roumaine n°8 de 1996, chapitre III, article 9, paragraphe (c), de tels symboles ne peuvent bénéficier d'un droit à l'image et sont donc dans le domaine public. Ceci s'applique dans tout pays."
"flag_russia";"https://commons.wikimedia.org/wiki/File:Flag_of_Russia.svg?uselang=fr";"Zscout370";"Domaine public";"Cette image de géométrie simple est inéligible au droit d'auteur et par conséquent est dans le domaine public, parce qu'elle est intégralement constituée d'éléments qui font partie du patrimoine public."
"flag_serbia";"https://commons.wikimedia.org/wiki/File:Flag_of_Serbia.svg?uselang=fr";"sodipodi.com";"Domaine public";"Ce fichier est dans le domaine public selon la loi Serbe car il fait partie d’une loi, ordonnance ou décret officiel émis par une autorité fédérale ou d’État, ou car il est principalement d’usage officiel."
"flag_slovakia";"https://commons.wikimedia.org/wiki/File:Flag_of_Slovakia.svg?uselang=fr";"Skopp";"Domaine public";"Moi, propriétaire du copyright de cette œuvre, la place dans le domaine public. Ceci s'applique dans le monde entier. Dans certains pays, ceci peut ne pas être possible , dans ce cas : J'accorde à toute personne le droit d'utiliser cette œuvre dans n'importe quel but, sans aucune condition, sauf celles requises par la loi."
"flag_slovenia";"https://commons.wikimedia.org/wiki/File:Flag_of_Slovenia.svg?uselang=fr";"Achim1999";"Domaine public";"Moi, propriétaire du copyright de cette œuvre, la place dans le domaine public. Ceci s'applique dans le monde entier. Dans certains pays, ceci peut ne pas être possible , dans ce cas : J'accorde à toute personne le droit d'utiliser cette œuvre dans n'importe quel but, sans aucune condition, sauf celles requises par la loi."
"flag_spain";"https://commons.wikimedia.org/wiki/File:Flag_of_Spain.svg?uselang=fr";"Pedro A. Gracia Fajardo";"CC0 1.0";"Don universel au domaine public. La personne qui a associé une œuvre avec cet acte l’a placée dans le domaine public en renonçant mondialement à tous ses droits sur cette œuvre en vertu des lois relatives au droit d’auteur, ainsi qu’à tous les droits juridiques connexes et voisins qu’elle possédait sur l’œuvre, sans autre limite que celles imposées par la loi. Vous pouvez copier, modifier, distribuer et utiliser cette œuvre, y compris à des fins commerciales, sans qu’il soit nécessaire d’en demander la permission."
"flag_sweden";"https://commons.wikimedia.org/wiki/File:Flag_of_Sweden.svg?uselang=fr";"Jon Harald Søby";"Domaine public";"Cette image de géométrie simple est inéligible au droit d'auteur et par conséquent est dans le domaine public, parce qu'elle est intégralement constituée d'éléments qui font partie du patrimoine public."
"flag_switzerland";"https://commons.wikimedia.org/wiki/File:Flag_of_Switzerland.svg?uselang=fr";"Marc Mongenet, -xfi-, Zscout370";"Domaine public";"Cette image de géométrie simple est inéligible au droit d'auteur et par conséquent est dans le domaine public, parce qu'elle est intégralement constituée d'éléments qui font partie du patrimoine public."
"flag_tajikistan";"https://commons.wikimedia.org/wiki/File:Flag_of_Tajikistan.svg?uselang=fr";;"Domaine public";"Ce fichier est dans le domaine public selon la loi du Tajikistan car il fait partie d’une loi, ordonnance ou décret officiel émis par une autorité fédérale ou d’État, ou car il est principalement d’usage officiel."
"flag_tunisia";"https://commons.wikimedia.org/wiki/File:Flag_of_Tunisia.svg?uselang=fr";"Ben Khalifa Wissam";"Domaine public";"Moi, propriétaire du copyright de cette œuvre, la place dans le domaine public. Ceci s'applique dans le monde entier. Dans certains pays, ceci peut ne pas être possible , dans ce cas : J'accorde à toute personne le droit d'utiliser cette œuvre dans n'importe quel but, sans aucune condition, sauf celles requises par la loi."
"flag_turkey";"https://commons.wikimedia.org/wiki/File:Flag_of_Turkey.svg?uselang=fr";"David Benbennick";"Domaine public";"Moi, propriétaire du copyright de cette œuvre, la place dans le domaine public. Ceci s'applique dans le monde entier. Dans certains pays, ceci peut ne pas être possible , dans ce cas : J'accorde à toute personne le droit d'utiliser cette œuvre dans n'importe quel but, sans aucune condition, sauf celles requises par la loi."
"flag_ukraine";"https://commons.wikimedia.org/wiki/File:Flag_of_Ukraine.svg?uselang=fr";"Gouvernement Ukrainien";"Domaine public";"Ce fichier est dans le domaine public selon la loi Ukrainienne car il fait partie d’une loi, ordonnance ou décret officiel émis par une autorité fédérale ou d’État, ou car il est principalement d’usage officiel."
"flag_united_kingdom";"https://commons.wikimedia.org/wiki/File:Flag_of_the_United_Kingdom.svg?uselang=fr";"Zscout370";"Domaine public";"Cette œuvre d'art créée par le Gouvernement du Royaume-Uni se trouve dans le domaine public. Cette œuvre est également dans le domaine public dans tous les pays pour lesquels le copyright a une durée de vie de 100 ans ou moins après la mort de l'auteur. Cette œuvre est dans le domaine public aux États-Unis car elle a été publiée avant le 1er janvier 1923."
"ic_adr_1";"https://commons.wikimedia.org/wiki/File:ADR_1.svg?uselang=fr";"United Nations Economic Commision for Europe";"Domaine public";"Ce document n'est pas soumis au droit d'auteur et est donc dans le domaine public, car il est composé exclusivement d'informations qui sont dans le domaine public et ne contient aucune modification qui en ferait une œuvre originale."
"ic_adr_1_4";"https://commons.wikimedia.org/wiki/File:ADR_1.4.svg?uselang=fr";"United Nations Economic Commision for Europe";"Domaine public";"Ce document n'est pas soumis au droit d'auteur et est donc dans le domaine public, car il est composé exclusivement d'informations qui sont dans le domaine public et ne contient aucune modification qui en ferait une œuvre originale."
"ic_adr_1_5";"https://commons.wikimedia.org/wiki/File:ADR_1.5.svg?uselang=fr";"United Nations Economic Commision for Europe";"Domaine public";"Ce document n'est pas soumis au droit d'auteur et est donc dans le domaine public, car il est composé exclusivement d'informations qui sont dans le domaine public et ne contient aucune modification qui en ferait une œuvre originale."
"ic_adr_1_6";"https://commons.wikimedia.org/wiki/File:ADR_1.6.svg?uselang=fr";"United Nations Economic Commision for Europe";"Domaine public";"Ce document n'est pas soumis au droit d'auteur et est donc dans le domaine public, car il est composé exclusivement d'informations qui sont dans le domaine public et ne contient aucune modification qui en ferait une œuvre originale."
"ic_adr_2_1";"https://commons.wikimedia.org/wiki/File:ADR_2.1.svg?uselang=fr";"United Nations Economic Commision for Europe";"Domaine public";"Ce document n'est pas soumis au droit d'auteur et est donc dans le domaine public, car il est composé exclusivement d'informations qui sont dans le domaine public et ne contient aucune modification qui en ferait une œuvre originale."
"ic_adr_2_1_b";"https://commons.wikimedia.org/wiki/File:ADR_2.1b.svg?uselang=fr";"United Nations Economic Commision for Europe";"Domaine public";"Ce document n'est pas soumis au droit d'auteur et est donc dans le domaine public, car il est composé exclusivement d'informations qui sont dans le domaine public et ne contient aucune modification qui en ferait une œuvre originale."
"ic_adr_2_2";"https://commons.wikimedia.org/wiki/File:ADR_2.2.svg?uselang=fr";"United Nations Economic Commision for Europe";"Domaine public";"Ce document n'est pas soumis au droit d'auteur et est donc dans le domaine public, car il est composé exclusivement d'informations qui sont dans le domaine public et ne contient aucune modification qui en ferait une œuvre originale."
"ic_adr_2_2_b";"https://commons.wikimedia.org/wiki/File:ADR_2.2b.svg?uselang=fr";"United Nations Economic Commision for Europe";"Domaine public";"Ce document n'est pas soumis au droit d'auteur et est donc dans le domaine public, car il est composé exclusivement d'informations qui sont dans le domaine public et ne contient aucune modification qui en ferait une œuvre originale."
"ic_adr_2_3";"https://commons.wikimedia.org/wiki/File:ADR_2.3.svg?uselang=fr";"United Nations Economic Commision for Europe";"Domaine public";"Ce document n'est pas soumis au droit d'auteur et est donc dans le domaine public, car il est composé exclusivement d'informations qui sont dans le domaine public et ne contient aucune modification qui en ferait une œuvre originale."
"ic_adr_3";"https://commons.wikimedia.org/wiki/File:ADR_3.svg?uselang=fr";"United Nations Economic Commision for Europe";"Domaine public";"Ce document n'est pas soumis au droit d'auteur et est donc dans le domaine public, car il est composé exclusivement d'informations qui sont dans le domaine public et ne contient aucune modification qui en ferait une œuvre originale."
"ic_adr_3_b";"https://commons.wikimedia.org/wiki/File:ADR_3b.svg?uselang=fr";"United Nations Economic Commision for Europe";"Domaine public";"Ce document n'est pas soumis au droit d'auteur et est donc dans le domaine public, car il est composé exclusivement d'informations qui sont dans le domaine public et ne contient aucune modification qui en ferait une œuvre originale."
"ic_adr_4_1";"https://commons.wikimedia.org/wiki/File:ADR_4.1.svg?uselang=fr";"United Nations Economic Commision for Europe";"Domaine public";"Ce document n'est pas soumis au droit d'auteur et est donc dans le domaine public, car il est composé exclusivement d'informations qui sont dans le domaine public et ne contient aucune modification qui en ferait une œuvre originale."
"ic_adr_4_2";"https://commons.wikimedia.org/wiki/File:ADR_4.2.svg?uselang=fr";"United Nations Economic Commision for Europe";"Domaine public";"Ce document n'est pas soumis au droit d'auteur et est donc dans le domaine public, car il est composé exclusivement d'informations qui sont dans le domaine public et ne contient aucune modification qui en ferait une œuvre originale."
"ic_adr_4_3";"https://commons.wikimedia.org/wiki/File:ADR_4.3.svg?uselang=fr";"United Nations Economic Commision for Europe";"Domaine public";"Ce document n'est pas soumis au droit d'auteur et est donc dans le domaine public, car il est composé exclusivement d'informations qui sont dans le domaine public et ne contient aucune modification qui en ferait une œuvre originale."
"ic_adr_4_3_b";"https://commons.wikimedia.org/wiki/File:ADR_4.3b.svg?uselang=fr";"United Nations Economic Commision for Europe";"Domaine public";"Ce document n'est pas soumis au droit d'auteur et est donc dans le domaine public, car il est composé exclusivement d'informations qui sont dans le domaine public et ne contient aucune modification qui en ferait une œuvre originale."
"ic_adr_5_1";"https://commons.wikimedia.org/wiki/File:ADR_5.1.svg?uselang=fr";"United Nations Economic Commision for Europe";"Domaine public";"Ce document n'est pas soumis au droit d'auteur et est donc dans le domaine public, car il est composé exclusivement d'informations qui sont dans le domaine public et ne contient aucune modification qui en ferait une œuvre originale."
"ic_adr_5_2";"https://commons.wikimedia.org/wiki/File:ADR_5.2.svg?uselang=fr";"United Nations Economic Commision for Europe";"Domaine public";"Ce document n'est pas soumis au droit d'auteur et est donc dans le domaine public, car il est composé exclusivement d'informations qui sont dans le domaine public et ne contient aucune modification qui en ferait une œuvre originale."
"ic_adr_5_2_b";"https://commons.wikimedia.org/wiki/File:ADR_5.2b.svg?uselang=fr";"United Nations Economic Commision for Europe";"Domaine public";"Ce document n'est pas soumis au droit d'auteur et est donc dans le domaine public, car il est composé exclusivement d'informations qui sont dans le domaine public et ne contient aucune modification qui en ferait une œuvre originale."
"ic_adr_6_1";"https://commons.wikimedia.org/wiki/File:UN_transport_pictogram_-_6.svg?uselang=fr";"United Nations Economic Commision for Europe";"Domaine public";"Ce document n'est pas soumis au droit d'auteur et est donc dans le domaine public, car il est composé exclusivement d'informations qui sont dans le domaine public et ne contient aucune modification qui en ferait une œuvre originale."
"ic_adr_6_2";"https://commons.wikimedia.org/wiki/File:ADR_6.2.svg?uselang=fr";"United Nations Economic Commision for Europe";"Domaine public";"Ce document n'est pas soumis au droit d'auteur et est donc dans le domaine public, car il est composé exclusivement d'informations qui sont dans le domaine public et ne contient aucune modification qui en ferait une œuvre originale."
"ic_adr_7a";"https://commons.wikimedia.org/wiki/File:ADR_7A.svg?uselang=fr";"United Nations Economic Commision for Europe";"Domaine public";"Ce document n'est pas soumis au droit d'auteur et est donc dans le domaine public, car il est composé exclusivement d'informations qui sont dans le domaine public et ne contient aucune modification qui en ferait une œuvre originale."
"ic_adr_7b";"https://commons.wikimedia.org/wiki/File:ADR_7B.svg?uselang=fr";"United Nations Economic Commision for Europe";"Domaine public";"Ce document n'est pas soumis au droit d'auteur et est donc dans le domaine public, car il est composé exclusivement d'informations qui sont dans le domaine public et ne contient aucune modification qui en ferait une œuvre originale."
"ic_adr_7c";"https://commons.wikimedia.org/wiki/File:ADR_7C.svg?uselang=fr";"United Nations Economic Commision for Europe";"Domaine public";"Ce document n'est pas soumis au droit d'auteur et est donc dans le domaine public, car il est composé exclusivement d'informations qui sont dans le domaine public et ne contient aucune modification qui en ferait une œuvre originale."
"ic_adr_7d";"https://commons.wikimedia.org/wiki/File:Radiation_diamond.svg?uselang=fr";"rfc1394";"CC BY-SA 3.0";"Vous êtes libre de partager, de copier, distribuer et transmettre cette œuvre, d’adapter, de modifier cette œuvre. Sous les conditions suivantes : paternité – Vous devez citer le nom de l’auteur original de la manière indiquée par l’auteur de l’œuvre ou le titulaire des droits qui vous confère cette autorisation (mais pas d’une manière qui suggérerait qu’il vous soutienne ou approuve votre utilisation de l’œuvre). Partage à l’identique – Si vous modifiez, transformez, ou vous basez sur cette œuvre, vous devez distribuer l’œuvre résultante sous la même licence ou une licence similaire à celle-ci."
"ic_adr_7e";"https://commons.wikimedia.org/wiki/File:ADR_7E.svg?uselang=fr";"United Nations Economic Commision for Europe";"Domaine public";"Ce document n'est pas soumis au droit d'auteur et est donc dans le domaine public, car il est composé exclusivement d'informations qui sont dans le domaine public et ne contient aucune modification qui en ferait une œuvre originale."
"ic_adr_8";"https://commons.wikimedia.org/wiki/File:ADR_8.svg?uselang=fr";"United Nations Economic Commision for Europe";"Domaine public";"Ce document n'est pas soumis au droit d'auteur et est donc dans le domaine public, car il est composé exclusivement d'informations qui sont dans le domaine public et ne contient aucune modification qui en ferait une œuvre originale."
"ic_adr_9";"https://commons.wikimedia.org/wiki/File:ADR_9.svg?uselang=fr";"United Nations Economic Commision for Europe";"Domaine public";"Ce document n'est pas soumis au droit d'auteur et est donc dans le domaine public, car il est composé exclusivement d'informations qui sont dans le domaine public et ne contient aucune modification qui en ferait une œuvre originale."
"ic_adr_9a";"https://commons.wikimedia.org/wiki/File:ADR_9A.svg?uselang=fr";"United Nations Economic Commision for Europe";"Domaine public";"Ce document n'est pas soumis au droit d'auteur et est donc dans le domaine public, car il est composé exclusivement d'informations qui sont dans le domaine public et ne contient aucune modification qui en ferait une œuvre originale."
"ic_adr_code";"https://commons.wikimedia.org/wiki/File:ADR_dimensions.svg?uselang=fr";"United Nations Economic Commision for Europe";"Domaine public";"Ce document n'est pas soumis au droit d'auteur et est donc dans le domaine public, car il est composé exclusivement d'informations qui sont dans le domaine public et ne contient aucune modification qui en ferait une œuvre originale."
"ic_adr_code_square";"https://commons.wikimedia.org/wiki/File:ADR_dimensions.svg?uselang=fr";"United Nations Economic Commision for Europe";"Domaine public";"Ce document n'est pas soumis au droit d'auteur et est donc dans le domaine public, car il est composé exclusivement d'informations qui sont dans le domaine public et ne contient aucune modification qui en ferait une œuvre originale."
"ic_adr_env";"https://commons.wikimedia.org/wiki/File:UN_transport_pictogram_-_pollution.svg?uselang=fr";"Wostr";"Domaine public";"Moi, propriétaire du copyright de cette œuvre, la place dans le domaine public. Ceci s'applique dans le monde entier. Dans certains pays, ceci peut ne pas être possible , dans ce cas : J'accorde à toute personne le droit d'utiliser cette œuvre dans n'importe quel but, sans aucune condition, sauf celles requises par la loi."
"ic_adr_hot";"https://commons.wikimedia.org/wiki/File:ADR_hot.svg?uselang=fr";"United Nations Economic Commision for Europe";"Domaine public";"Ce document n'est pas soumis au droit d'auteur et est donc dans le domaine public, car il est composé exclusivement d'informations qui sont dans le domaine public et ne contient aucune modification qui en ferait une œuvre originale."
"ic_arrow_back_black";"https://material.io/tools/icons/?style=twotone";"Material Design";"Apache License Version 2.0";""
"ic_arrow_back_white";"https://material.io/tools/icons/?style=twotone";"Material Design";"Apache License Version 2.0";""
"ic_arrow_left_black";"https://material.io/tools/icons/?style=twotone";"Material Design";"Apache License Version 2.0";""
"ic_arrow_right_black";"https://material.io/tools/icons/?style=twotone";"Material Design";"Apache License Version 2.0";""
"ic_check_update_black";"https://material.io/tools/icons/?style=twotone";"Material Design";"Apache License Version 2.0";""
"ic_check_update_white";"https://material.io/tools/icons/?style=twotone";"Material Design";"Apache License Version 2.0";""
"ic_close_black";"https://material.io/tools/icons/?style=twotone";"Material Design";"Apache License Version 2.0";""
"ic_close_white";"https://material.io/tools/icons/?style=twotone";"Material Design";"Apache License Version 2.0";""
"ic_delete_black";"https://material.io/tools/icons/?style=twotone";"Material Design";"Apache License Version 2.0";""
"ic_delete_white";"https://material.io/tools/icons/?style=twotone";"Material Design";"Apache License Version 2.0";""
"ic_down_black";"https://material.io/tools/icons/?style=twotone";"Material Design";"Apache License Version 2.0";""
"ic_down_white";"https://material.io/tools/icons/?style=twotone";"Material Design";"Apache License Version 2.0";""
"ic_earth_black";"https://material.io/tools/icons/?style=twotone";"Material Design";"Apache License Version 2.0";""
"ic_earth_white";"https://material.io/tools/icons/?style=twotone";"Material Design";"Apache License Version 2.0";""
"ic_ghs_1";"https://commons.wikimedia.org/wiki/File:GHS-pictogram-explos.svg?uselang=fr";;"Domaine public";"Ce document n'est pas soumis au droit d'auteur et est donc dans le domaine public, car il est composé exclusivement d'informations qui sont dans le domaine public et ne contient aucune modification qui en ferait une œuvre originale."
"ic_ghs_2";"https://commons.wikimedia.org/wiki/File:GHS-pictogram-flamme.svg?uselang=fr";;"Domaine public";"Ce document n'est pas soumis au droit d'auteur et est donc dans le domaine public, car il est composé exclusivement d'informations qui sont dans le domaine public et ne contient aucune modification qui en ferait une œuvre originale."
"ic_ghs_3";"https://commons.wikimedia.org/wiki/File:GHS-pictogram-rondflam.svg?uselang=fr";;"Domaine public";"Ce document n'est pas soumis au droit d'auteur et est donc dans le domaine public, car il est composé exclusivement d'informations qui sont dans le domaine public et ne contient aucune modification qui en ferait une œuvre originale."
"ic_ghs_4";"https://commons.wikimedia.org/wiki/File:GHS-pictogram-bottle.svg?uselang=fr";;"Domaine public";"Ce document n'est pas soumis au droit d'auteur et est donc dans le domaine public, car il est composé exclusivement d'informations qui sont dans le domaine public et ne contient aucune modification qui en ferait une œuvre originale."
"ic_ghs_5";"https://commons.wikimedia.org/wiki/File:GHS-pictogram-acid.svg?uselang=fr";;"Domaine public";"Ce document n'est pas soumis au droit d'auteur et est donc dans le domaine public, car il est composé exclusivement d'informations qui sont dans le domaine public et ne contient aucune modification qui en ferait une œuvre originale."
"ic_ghs_6";"https://commons.wikimedia.org/wiki/File:GHS-pictogram-skull.svg?uselang=fr";;"Domaine public";"Ce document n'est pas soumis au droit d'auteur et est donc dans le domaine public, car il est composé exclusivement d'informations qui sont dans le domaine public et ne contient aucune modification qui en ferait une œuvre originale."
"ic_ghs_7";"https://commons.wikimedia.org/wiki/File:GHS-pictogram-exclam.svg?uselang=fr";;"Domaine public";"Ce document n'est pas soumis au droit d'auteur et est donc dans le domaine public, car il est composé exclusivement d'informations qui sont dans le domaine public et ne contient aucune modification qui en ferait une œuvre originale."
"ic_ghs_8";"https://commons.wikimedia.org/wiki/File:GHS-pictogram-silhouette.svg?uselang=fr";;"Domaine public";"Ce document n'est pas soumis au droit d'auteur et est donc dans le domaine public, car il est composé exclusivement d'informations qui sont dans le domaine public et ne contient aucune modification qui en ferait une œuvre originale."
"ic_ghs_9";"https://commons.wikimedia.org/wiki/File:GHS-pictogram-pollu.svg?uselang=fr";;"Domaine public";"Ce document n'est pas soumis au droit d'auteur et est donc dans le domaine public, car il est composé exclusivement d'informations qui sont dans le domaine public et ne contient aucune modification qui en ferait une œuvre originale."
"ic_ghs_e";"https://commons.wikimedia.org/wiki/File:Hazard_E.svg?uselang=fr";;"Domaine public";"Ce document n'est pas soumis au droit d'auteur et est donc dans le domaine public, car il est composé exclusivement d'informations qui sont dans le domaine public et ne contient aucune modification qui en ferait une œuvre originale."
"ic_ghs_fp";"https://commons.wikimedia.org/wiki/File:Hazard_FF.svg?uselang=fr";;"Domaine public";"Ce document n'est pas soumis au droit d'auteur et est donc dans le domaine public, car il est composé exclusivement d'informations qui sont dans le domaine public et ne contient aucune modification qui en ferait une œuvre originale."
"ic_ghs_f";"https://commons.wikimedia.org/wiki/File:Hazard_F.svg?uselang=fr";"Phrood";"Domaine public";"Ce document n'est pas soumis au droit d'auteur et est donc dans le domaine public, car il est composé exclusivement d'informations qui sont dans le domaine public et ne contient aucune modification qui en ferait une œuvre originale."
"ic_ghs_o";"https://commons.wikimedia.org/wiki/File:Hazard_O.svg?uselang=fr";;"Domaine public";"Ce document n'est pas soumis au droit d'auteur et est donc dans le domaine public, car il est composé exclusivement d'informations qui sont dans le domaine public et ne contient aucune modification qui en ferait une œuvre originale."
"ic_ghs_tp";"https://commons.wikimedia.org/wiki/File:Hazard_TT.svg?uselang=fr";;"Domaine public";"Ce document n'est pas soumis au droit d'auteur et est donc dans le domaine public, car il est composé exclusivement d'informations qui sont dans le domaine public et ne contient aucune modification qui en ferait une œuvre originale."
"ic_ghs_t";"https://commons.wikimedia.org/wiki/File:Hazard_T.svg?uselang=fr";;"Domaine public";"Ce document n'est pas soumis au droit d'auteur et est donc dans le domaine public, car il est composé exclusivement d'informations qui sont dans le domaine public et ne contient aucune modification qui en ferait une œuvre originale."
"ic_ghs_xn";"https://commons.wikimedia.org/wiki/File:Hazard_X.svg?uselang=fr";;"Domaine public";"Ce document n'est pas soumis au droit d'auteur et est donc dans le domaine public, car il est composé exclusivement d'informations qui sont dans le domaine public et ne contient aucune modification qui en ferait une œuvre originale."
"ic_ghs_xi";"https://commons.wikimedia.org/wiki/File:Hazard_Xi.svg?uselang=fr";;"Domaine public";"Ce document n'est pas soumis au droit d'auteur et est donc dans le domaine public, car il est composé exclusivement d'informations qui sont dans le domaine public et ne contient aucune modification qui en ferait une œuvre originale."
"ic_ghs_c";"https://commons.wikimedia.org/wiki/File:Hazard_C.svg?uselang=fr";;"Domaine public";"Ce document n'est pas soumis au droit d'auteur et est donc dans le domaine public, car il est composé exclusivement d'informations qui sont dans le domaine public et ne contient aucune modification qui en ferait une œuvre originale."
"ic_ghs_n";"https://commons.wikimedia.org/wiki/File:Hazard_N.svg?uselang=fr";;"Domaine public";"Ce document n'est pas soumis au droit d'auteur et est donc dans le domaine public, car il est composé exclusivement d'informations qui sont dans le domaine public et ne contient aucune modification qui en ferait une œuvre originale."
"ic_help_black";"https://material.io/tools/icons/?style=twotone";"Material Design";"Apache License Version 2.0";""
"ic_help_white";"https://material.io/tools/icons/?style=twotone";"Material Design";"Apache License Version 2.0";""
"ic_home_black";"https://material.io/tools/icons/?style=twotone";"Material Design";"Apache License Version 2.0";""
"ic_home_white";"https://material.io/tools/icons/?style=twotone";"Material Design";"Apache License Version 2.0";""
"ic_icon";"https://www.gendarmerie.interieur.gouv.fr/";"Gendarmerie Nationale";"Tous droits réservés";""
"ic_icon_round";"https://www.gendarmerie.interieur.gouv.fr/";"Gendarmerie Nationale";"Tous droits réservés";""
"ic_kemler_checkbox_checked";"https://www.gendarmerie.interieur.gouv.fr/";"Gendarmerie Nationale";"Tous droits réservés";""
"ic_kemler_checkbox_unchecked";"https://www.gendarmerie.interieur.gouv.fr/";"Gendarmerie Nationale";"Tous droits réservés";""
"ic_menu_black";"https://material.io/tools/icons/?style=twotone";"Material Design";"Apache License Version 2.0";""
"ic_menu_white";"https://material.io/tools/icons/?style=twotone";"Material Design";"Apache License Version 2.0";""
"ic_mosaic_adr";"https://www.gendarmerie.interieur.gouv.fr/";"Gendarmerie Nationale";"Domaine public";"Ce document n'est pas soumis au droit d'auteur et est donc dans le domaine public, car il est composé exclusivement d'informations qui sont dans le domaine public et ne contient aucune modification qui en ferait une œuvre originale."
"ic_refresh_black";"https://material.io/tools/icons/?style=twotone";"Material Design";"Apache License Version 2.0";""
"ic_refresh_white";"https://material.io/tools/icons/?style=twotone";"Material Design";"Apache License Version 2.0";""
"ic_search_black";"https://material.io/tools/icons/?style=twotone";"Material Design";"Apache License Version 2.0";""
"ic_search_white";"https://material.io/tools/icons/?style=twotone";"Material Design";"Apache License Version 2.0";""
"ic_settings_black";"https://material.io/tools/icons/?style=twotone";"Material Design";"Apache License Version 2.0";""
"ic_settings_white";"https://material.io/tools/icons/?style=twotone";"Material Design";"Apache License Version 2.0";""
"ic_up_black";"https://material.io/tools/icons/?style=twotone";"Material Design";"Apache License Version 2.0";""
"ic_up_white";"https://material.io/tools/icons/?style=twotone";"Material Design";"Apache License Version 2.0";""
"ic_update_black";"https://material.io/tools/icons/?style=twotone";"Material Design";"Apache License Version 2.0";""
"ic_update_white";"https://material.io/tools/icons/?style=twotone";"Material Design";"Apache License Version 2.0";""
"logo_database_black";"https://www.iconfinder.com/icons/882779/database_hosting_network_refresh_reload_server_icon";"Yugu Design";"Gratuit pour un usage commercial";"Gratuit pour un usage commercial"
"logo_copyright_black";"https://commons.wikimedia.org/wiki/File:PD-icon.svg";"Duesentrieb";"Ce document n'est pas soumis au droit d'auteur et est donc dans le domaine public, car il est composé exclusivement d'informations qui sont dans le domaine public et ne contient aucune modification qui en ferait une œuvre originale.";"Ce document n'est pas soumis au droit d'auteur et est donc dans le domaine public, car il est composé exclusivement d'informations qui sont dans le domaine public et ne contient aucune modification qui en ferait une œuvre originale."
"logo_un";"https://commons.wikimedia.org/wiki/File:UN_emblem_blue.svg?uselang=fr";"Joowwww";"Domaine public";"Ce fichier est extrait d'un document officiel des Nations unies. Or jusqu'au 17 septembre 1987 la politique officielle de l'ONU est de mettre la majorité des ses documents dans le domaine public, dans l'objectif de répandre le plus largement possible les idées contenues dans les publications de l'ONU.\n\nL'instruction administrative ST/AI/189/Add.9/Rev.1 (disponible sur Wikisource en anglais ou sur le site officiel dans la même langue) dans son annexe, liste les publications onusiennes soumises au droit d'auteur. En conséquence, les publications absentes de cette liste datées d'avant le 17 septembre 1987 sont dans le domaine public car elles ne contiennent pas de notice de copyright et ne sont donc pas enregistrées auprès de l'U.S. Copyright Office.\n\nEn résumé, ce fichier est dans le domaine public aux États-Unis car : il a été publié par les Nations unies avant le 17 septembre 1987, et il ne fait pas partie des documents listés dans l'instruction administrative ST/AI/189/Add.9/Rev.1 (par exception au principe général, ces documents sont sous copyright). Ce document reste soumis au droit d'auteur dans les juridictions qui n'appliquent pas la règle du terme le plus court pour les travaux de l'ONU, ou, qui spécifiquement étendent leur législation sur le droit d'auteur aux travaux de l'ONU."